{"text_format":"1","workbook":"xlsx","n_sheets":6,"sheets":["사원정보(입력)","급여대장(입력)","급여명세서","4대보험료 계산","2021_근로소득간이세액표","option"],"not_rendered":{"charts":0,"images":6,"macros":1,"external_links":0,"defined_names":13,"comments":2,"pivot_tables":0},"unopened":[],"bounds":{"document_bytes":16777216,"sheet_cells":100000,"rows_first":2000,"rows_last":500,"rows_between":2000,"halvings":0,"cell_chars":16384,"cell_head_chars":4096},"cells_cut":0,"cells_raw":0,"read":"whole","date_system":"1900"}

{"sheet":"사원정보(입력)","index":0,"n_rows":14,"n_cols":26,"rows_kept":14,"cut":false,"hidden":false,"merged":[[2,1,3,1],[5,20,5,21]]}
["직원(사무직, 직영 및 지입 택배기사) 현황표"]
[]
[null,"사원\n현황","등록 ","재직","퇴사"]
[null,null,{"$f":"D4+E4","v":8},{"$f":"COUNTIF(표1[상태],\"재직\")","v":8},{"$f":"COUNTIF(표1[상태],\"퇴사\")","v":0}]
[]
[null,"사원명","사원번호","계약구분","직책","상태","입사일\n(yyyy-mm-dd)","퇴사일\n(yyyy-mm-dd)","급여계좌","부양가족","20세이하\n자녀","열3","열1","열2","국민연금","건강보험","노인장기\n요양보험","고용보험","소득세",null,"4대보험 요율(%)",null,"상한액","하한액"]
[null,"홍길동","lgl600001",null,"OP","재직",null,null,null,2,1,null,null,null,"1) 공제","1) 공제","1) 공제","1) 공제","1) 일반_100%",null," 국민연금_근로자분",4.5,226350,14400]
[null,"아무개",600002,null,"OP","재직",null,null,null,1,null,null,null,null,"1) 공제","1) 공제","1) 공제","1) 공제","1) 일반_100%",null," 건강보험_근로자분",3.43,3322170,9300]
[null,"김",600003,"직영","SM","재직",null,null,null,2,1,null,null,null,"1) 공제","1) 공제","1) 공제","1) 공제","1) 일반_100%",null," 노인장기요양_근로자분",11.52]
[null,"이",600004,"직영","SM","재직",null,null,null,1,null,null,null,null,"1) 공제","1) 공제","1) 공제","1) 공제","1) 일반_100%",null," 고용보험_근로자분",0.8]
{"$rows_left_out":5}
{"sheet":"급여대장(입력)","index":1,"n_rows":36,"n_cols":39,"rows_kept":36,"cut":false,"hidden":false,"merged":[[35,1,35,5],[3,22,3,37],[3,38,4,38],[3,6,3,21],[3,1,3,5]]}
["급여대장(근로소득/사업소득)  Pay Management"]
[]
[null,"2021년 8월",null,null,null,null,null,null,null,null,null,null,null,null,null,null,null,null,null,null,null,null,null,null,null,null,null,null,null,null,null,null,null,null,null,null,null,null,"(단위:원, VAT포함)"]
[null,"사원현황",null,null,null,null,"지급 금액",null,null,null,null,null,null,null,null,null,null,null,null,null,null,null,"공제 금액",null,null,null,null,null,null,null,null,null,null,null,null,null,null,null,"지급액"]
[null,"번호","사원명","사원번호","계약구분","직책","기본급","식대","개발수수료","집하수수료","배송수수료","분류비","유류지원금","교통비","연장근로수당","근속수당","직책수당","","","","","지급합계","소득세","지방소득세","국민연금","건강보험","노인장기요양","고용보험(근로)","고용보험(특고)","산재보험(특고)","운송장","포장 테이프","전산장비","화물사고 분담","","","","공제합계"]
[null,1,{"$f":"'사원정보(입력)'!B7","v":"홍길동"},{"$f":"IFERROR(VLOOKUP(C6,표1[],2,0),\"\")","v":"lgl600001"},{"$f":"IFERROR(VLOOKUP(C6,표1[],3,0),\"\")","v":0},{"$f":"IFERROR(VLOOKUP(C6,표1[],4,0),\"\")","v":"OP"},2500000,100000,null,null,null,null,null,100000,100000,100000,100000,null,null,null,null,{"$f":"SUM(G6:U6)","v":3000000},{"$f":"IF(LEN(C6)=0,0,IFERROR(IF(LEN(VLOOKUP(C6,표1[],18,0))=0,0,ROUNDDOWN(CHOOSE(LEFT(VLOOKUP(C6,표1[],18,0),1),INTAX(SUMIF(option!$C$2:$Q$2,0,G6:U6),VLOOKUP(C6,표1[],9,0),VLOOKUP(C6,표1[],10,0)),INTAX(SUMIF(option!$C$2:$Q$2,0,G6:U6),VLOOKUP(C6,표1[],9,0),VLOOKUP(C6,표1[],10,0))*1.2,INTAX(SUMIF(option!$C$2:$Q$2,0,G6:U6),VLOOKUP(C6,표1[],9,0),VLOOKUP(C6,표1[],10,0))*0.8,V6*(('사원정보(입력)'!V$13/1.1)/100),V6*(('사원정보(입력)'!V$14/1.1)/100)),option!$C$3*-1)),0))","v":28480},{"$f":"IF(W6=0,0,ROUNDDOWN(W6*0.1,option!$D$3*-1))","v":2848},{"$f":"IF(LEN(C6)=0,0,IFERROR(ROUNDDOWN(ctax(LEFT(VLOOKUP(C6,표1[],14,0),FIND(\")\",VLOOKUP(C6,표1[],14,0))-1),SUMIF(option!$C$2:$Q$2,0,G6:U6),'사원정보(입력)'!V$7,VLOOKUP(C6,표1[],12,0)),option!$E$3*-1),0))","v":130500},{"$f":"IF(LEN(C6)=0,0,IFERROR(ROUNDDOWN(HTAX(LEFT(VLOOKUP(C6,표1[],15,0),FIND(\")\",VLOOKUP(C6,표1[],15,0))-1),SUMIF(option!$C$2:$Q$2,0,G6:U6),'사원정보(입력)'!V$8,VLOOKUP(C6,표1[],13,0)),option!$F$3*-1),0))","v":99470},{"$f":"IF(Z6=0,0,IF(LEFT(VLOOKUP(C6,표1[],16,0),FIND(\")\",VLOOKUP(C6,표1[],16,0))-1)=\"2\",0,ROUNDDOWN(IF(LEFT(VLOOKUP(C6,표1[],16,0),FIND(\")\",VLOOKUP(C6,표1[],16,0))-1)=\"1\",Z6*('사원정보(입력)'!V$9/100),Z6*('사원정보(입력)'!V$9/100)*(1-((LEFT(VLOOKUP(C6,표1[],16,0),FIND(\")\",VLOOKUP(C6,표1[],16,0))-1)-2)/10))),option!$G$3*-1)))","v":11458},{"$f":"IF(LEN(C6)=0,0,IF(LEFT(VLOOKUP(C6,표1[],17,0),1)=\"2\",0,ROUNDDOWN(SUMIF(option!$C$2:$Q$2,0,G6:U6)*('사원정보(입력)'!V$10/100),option!$H$3*-1)))","v":23200},{"$f":"IF(E6=\"지입\",((V6/1.1)*79.8%)*0.7%,\"\")","v":""},{"$f":"IF(E6=\"지입\",11495,\"\")","v":""},null,null,null,null,null,null,null,{"$f":"SUM(W6:AK6)","v":295956},{"$f":"V6-AL6","v":2704044}]
[null,2,{"$f":"'사원정보(입력)'!B8","v":"아무개"},{"$f":"IFERROR(VLOOKUP(C7,표1[],2,0),\"\")","v":600002},{"$f":"IFERROR(VLOOKUP(C7,표1[],3,0),\"\")","v":0},{"$f":"IFERROR(VLOOKUP(C7,표1[],4,0),\"\")","v":"OP"},2500000,100000,null,null,null,null,null,100000,100000,100000,null,null,null,null,null,2900000,{"$f":"IF(LEN(C7)=0,0,IFERROR(IF(LEN(VLOOKUP(C7,표1[],18,0))=0,0,ROUNDDOWN(CHOOSE(LEFT(VLOOKUP(C7,표1[],18,0),1),INTAX(SUMIF(option!$C$2:$Q$2,0,G7:U7),VLOOKUP(C7,표1[],9,0),VLOOKUP(C7,표1[],10,0)),INTAX(SUMIF(option!$C$2:$Q$2,0,G7:U7),VLOOKUP(C7,표1[],9,0),VLOOKUP(C7,표1[],10,0))*1.2,INTAX(SUMIF(option!$C$2:$Q$2,0,G7:U7),VLOOKUP(C7,표1[],9,0),VLOOKUP(C7,표1[],10,0))*0.8,V7*(('사원정보(입력)'!V$13/1.1)/100),V7*(('사원정보(입력)'!V$14/1.1)/100)),option!$C$3*-1)),0))","v":67300},{"$f":"IF(W7=0,0,ROUNDDOWN(W7*0.1,option!$D$3*-1))","v":6730},{"$f":"IF(LEN(C7)=0,0,IFERROR(ROUNDDOWN(ctax(LEFT(VLOOKUP(C7,표1[],14,0),FIND(\")\",VLOOKUP(C7,표1[],14,0))-1),SUMIF(option!$C$2:$Q$2,0,G7:U7),'사원정보(입력)'!V$7,VLOOKUP(C7,표1[],12,0)),option!$E$3*-1),0))","v":126000},{"$f":"IF(LEN(C7)=0,0,IFERROR(ROUNDDOWN(HTAX(LEFT(VLOOKUP(C7,표1[],15,0),FIND(\")\",VLOOKUP(C7,표1[],15,0))-1),SUMIF(option!$C$2:$Q$2,0,G7:U7),'사원정보(입력)'!V$8,VLOOKUP(C7,표1[],13,0)),option!$F$3*-1),0))","v":96040},{"$f":"IF(Z7=0,0,IF(LEFT(VLOOKUP(C7,표1[],16,0),FIND(\")\",VLOOKUP(C7,표1[],16,0))-1)=\"2\",0,ROUNDDOWN(IF(LEFT(VLOOKUP(C7,표1[],16,0),FIND(\")\",VLOOKUP(C7,표1[],16,0))-1)=\"1\",Z7*('사원정보(입력)'!V$9/100),Z7*('사원정보(입력)'!V$9/100)*(1-((LEFT(VLOOKUP(C7,표1[],16,0),FIND(\")\",VLOOKUP(C7,표1[],16,0))-1)-2)/10))),option!$G$3*-1)))","v":11063},{"$f":"IF(LEN(C7)=0,0,IF(LEFT(VLOOKUP(C7,표1[],17,0),1)=\"2\",0,ROUNDDOWN(SUMIF(option!$C$2:$Q$2,0,G7:U7)*('사원정보(입력)'!V$10/100),option!$H$3*-1)))","v":22400},"","",null,null,null,50000,null,null,null,{"$f":"SUM(W7:AK7)","v":379533},{"$f":"V7-AL7","v":2520467}]
[null,3,{"$f":"'사원정보(입력)'!B9","v":"김"},{"$f":"IFERROR(VLOOKUP(C8,표1[],2,0),\"\")","v":600003},{"$f":"IFERROR(VLOOKUP(C8,표1[],3,0),\"\")","v":"직영"},{"$f":"IFERROR(VLOOKUP(C8,표1[],4,0),\"\")","v":"SM"},3500000,100000,null,null,null,null,null,100000,100000,100000,100000,null,null,null,null,4000000,{"$f":"IF(LEN(C8)=0,0,IFERROR(IF(LEN(VLOOKUP(C8,표1[],18,0))=0,0,ROUNDDOWN(CHOOSE(LEFT(VLOOKUP(C8,표1[],18,0),1),INTAX(SUMIF(option!$C$2:$Q$2,0,G8:U8),VLOOKUP(C8,표1[],9,0),VLOOKUP(C8,표1[],10,0)),INTAX(SUMIF(option!$C$2:$Q$2,0,G8:U8),VLOOKUP(C8,표1[],9,0),VLOOKUP(C8,표1[],10,0))*1.2,INTAX(SUMIF(option!$C$2:$Q$2,0,G8:U8),VLOOKUP(C8,표1[],9,0),VLOOKUP(C8,표1[],10,0))*0.8,V8*(('사원정보(입력)'!V$13/1.1)/100),V8*(('사원정보(입력)'!V$14/1.1)/100)),option!$C$3*-1)),0))","v":112370},{"$f":"IF(W8=0,0,ROUNDDOWN(W8*0.1,option!$D$3*-1))","v":11237},{"$f":"IF(LEN(C8)=0,0,IFERROR(ROUNDDOWN(ctax(LEFT(VLOOKUP(C8,표1[],14,0),FIND(\")\",VLOOKUP(C8,표1[],14,0))-1),SUMIF(option!$C$2:$Q$2,0,G8:U8),'사원정보(입력)'!V$7,VLOOKUP(C8,표1[],12,0)),option!$E$3*-1),0))","v":175500},{"$f":"IF(LEN(C8)=0,0,IFERROR(ROUNDDOWN(HTAX(LEFT(VLOOKUP(C8,표1[],15,0),FIND(\")\",VLOOKUP(C8,표1[],15,0))-1),SUMIF(option!$C$2:$Q$2,0,G8:U8),'사원정보(입력)'!V$8,VLOOKUP(C8,표1[],13,0)),option!$F$3*-1),0))","v":133770},{"$f":"IF(Z8=0,0,IF(LEFT(VLOOKUP(C8,표1[],16,0),FIND(\")\",VLOOKUP(C8,표1[],16,0))-1)=\"2\",0,ROUNDDOWN(IF(LEFT(VLOOKUP(C8,표1[],16,0),FIND(\")\",VLOOKUP(C8,표1[],16,0))-1)=\"1\",Z8*('사원정보(입력)'!V$9/100),Z8*('사원정보(입력)'!V$9/100)*(1-((LEFT(VLOOKUP(C8,표1[],16,0),FIND(\")\",VLOOKUP(C8,표1[],16,0))-1)-2)/10))),option!$G$3*-1)))","v":15410},{"$f":"IF(LEN(C8)=0,0,IF(LEFT(VLOOKUP(C8,표1[],17,0),1)=\"2\",0,ROUNDDOWN(SUMIF(option!$C$2:$Q$2,0,G8:U8)*('사원정보(입력)'!V$10/100),option!$H$3*-1)))","v":31200},"","",null,null,null,null,null,null,null,479487,{"$f":"V8-AL8","v":3520513}]
[null,4,{"$f":"'사원정보(입력)'!B10","v":"이"},{"$f":"IFERROR(VLOOKUP(C9,표1[],2,0),\"\")","v":600004},{"$f":"IFERROR(VLOOKUP(C9,표1[],3,0),\"\")","v":"직영"},{"$f":"IFERROR(VLOOKUP(C9,표1[],4,0),\"\")","v":"SM"},3500000,100000,null,null,null,null,null,100000,100000,100000,null,null,null,null,null,3900000,{"$f":"IF(LEN(C9)=0,0,IFERROR(IF(LEN(VLOOKUP(C9,표1[],18,0))=0,0,ROUNDDOWN(CHOOSE(LEFT(VLOOKUP(C9,표1[],18,0),1),INTAX(SUMIF(option!$C$2:$Q$2,0,G9:U9),VLOOKUP(C9,표1[],9,0),VLOOKUP(C9,표1[],10,0)),INTAX(SUMIF(option!$C$2:$Q$2,0,G9:U9),VLOOKUP(C9,표1[],9,0),VLOOKUP(C9,표1[],10,0))*1.2,INTAX(SUMIF(option!$C$2:$Q$2,0,G9:U9),VLOOKUP(C9,표1[],9,0),VLOOKUP(C9,표1[],10,0))*0.8,V9*(('사원정보(입력)'!V$13/1.1)/100),V9*(('사원정보(입력)'!V$14/1.1)/100)),option!$C$3*-1)),0))","v":184260},{"$f":"IF(W9=0,0,ROUNDDOWN(W9*0.1,option!$D$3*-1))","v":18426},{"$f":"IF(LEN(C9)=0,0,IFERROR(ROUNDDOWN(ctax(LEFT(VLOOKUP(C9,표1[],14,0),FIND(\")\",VLOOKUP(C9,표1[],14,0))-1),SUMIF(option!$C$2:$Q$2,0,G9:U9),'사원정보(입력)'!V$7,VLOOKUP(C9,표1[],12,0)),option!$E$3*-1),0))","v":171000},{"$f":"IF(LEN(C9)=0,0,IFERROR(ROUNDDOWN(HTAX(LEFT(VLOOKUP(C9,표1[],15,0),FIND(\")\",VLOOKUP(C9,표1[],15,0))-1),SUMIF(option!$C$2:$Q$2,0,G9:U9),'사원정보(입력)'!V$8,VLOOKUP(C9,표1[],13,0)),option!$F$3*-1),0))","v":130340},{"$f":"IF(Z9=0,0,IF(LEFT(VLOOKUP(C9,표1[],16,0),FIND(\")\",VLOOKUP(C9,표1[],16,0))-1)=\"2\",0,ROUNDDOWN(IF(LEFT(VLOOKUP(C9,표1[],16,0),FIND(\")\",VLOOKUP(C9,표1[],16,0))-1)=\"1\",Z9*('사원정보(입력)'!V$9/100),Z9*('사원정보(입력)'!V$9/100)*(1-((LEFT(VLOOKUP(C9,표1[],16,0),FIND(\")\",VLOOKUP(C9,표1[],16,0))-1)-2)/10))),option!$G$3*-1)))","v":15015},{"$f":"IF(LEN(C9)=0,0,IF(LEFT(VLOOKUP(C9,표1[],17,0),1)=\"2\",0,ROUNDDOWN(SUMIF(option!$C$2:$Q$2,0,G9:U9)*('사원정보(입력)'!V$10/100),option!$H$3*-1)))","v":30400},"","",null,null,null,null,null,null,null,549441,{"$f":"V9-AL9","v":3350559}]
[null,5,{"$f":"'사원정보(입력)'!B11","v":"박"},{"$f":"IFERROR(VLOOKUP(C10,표1[],2,0),\"\")","v":600005},{"$f":"IFERROR(VLOOKUP(C10,표1[],3,0),\"\")","v":"직영"},{"$f":"IFERROR(VLOOKUP(C10,표1[],4,0),\"\")","v":"SM"},3500000,100000,null,null,null,null,null,100000,100000,null,null,null,null,null,null,3800000,{"$f":"IF(LEN(C10)=0,0,IFERROR(IF(LEN(VLOOKUP(C10,표1[],18,0))=0,0,ROUNDDOWN(CHOOSE(LEFT(VLOOKUP(C10,표1[],18,0),1),INTAX(SUMIF(option!$C$2:$Q$2,0,G10:U10),VLOOKUP(C10,표1[],9,0),VLOOKUP(C10,표1[],10,0)),INTAX(SUMIF(option!$C$2:$Q$2,0,G10:U10),VLOOKUP(C10,표1[],9,0),VLOOKUP(C10,표1[],10,0))*1.2,INTAX(SUMIF(option!$C$2:$Q$2,0,G10:U10),VLOOKUP(C10,표1[],9,0),VLOOKUP(C10,표1[],10,0))*0.8,V10*(('사원정보(입력)'!V$13/1.1)/100),V10*(('사원정보(입력)'!V$14/1.1)/100)),option!$C$3*-1)),0))","v":141670},{"$f":"IF(W10=0,0,ROUNDDOWN(W10*0.1,option!$D$3*-1))","v":14167},{"$f":"IF(LEN(C10)=0,0,IFERROR(ROUNDDOWN(ctax(LEFT(VLOOKUP(C10,표1[],14,0),FIND(\")\",VLOOKUP(C10,표1[],14,0))-1),SUMIF(option!$C$2:$Q$2,0,G10:U10),'사원정보(입력)'!V$7,VLOOKUP(C10,표1[],12,0)),option!$E$3*-1),0))","v":166500},{"$f":"IF(LEN(C10)=0,0,IFERROR(ROUNDDOWN(HTAX(LEFT(VLOOKUP(C10,표1[],15,0),FIND(\")\",VLOOKUP(C10,표1[],15,0))-1),SUMIF(option!$C$2:$Q$2,0,G10:U10),'사원정보(입력)'!V$8,VLOOKUP(C10,표1[],13,0)),option!$F$3*-1),0))","v":126910},{"$f":"IF(Z10=0,0,IF(LEFT(VLOOKUP(C10,표1[],16,0),FIND(\")\",VLOOKUP(C10,표1[],16,0))-1)=\"2\",0,ROUNDDOWN(IF(LEFT(VLOOKUP(C10,표1[],16,0),FIND(\")\",VLOOKUP(C10,표1[],16,0))-1)=\"1\",Z10*('사원정보(입력)'!V$9/100),Z10*('사원정보(입력)'!V$9/100)*(1-((LEFT(VLOOKUP(C10,표1[],16,0),FIND(\")\",VLOOKUP(C10,표1[],16,0))-1)-2)/10))),option!$G$3*-1)))","v":14620},{"$f":"IF(LEN(C10)=0,0,IF(LEFT(VLOOKUP(C10,표1[],17,0),1)=\"2\",0,ROUNDDOWN(SUMIF(option!$C$2:$Q$2,0,G10:U10)*('사원정보(입력)'!V$10/100),option!$H$3*-1)))","v":29600},"","",null,null,null,null,null,null,null,493467,{"$f":"V10-AL10","v":3306533}]
{"$rows_left_out":27}
{"sheet":"급여명세서","index":2,"n_rows":27,"n_cols":7,"rows_kept":27,"cut":false,"hidden":false,"merged":[[24,4,24,6],[25,1,25,6],[9,4,9,5],[10,4,10,5],[11,4,11,5],[13,4,13,5],[7,1,14,1],[15,1,22,1],[26,1,26,6],[3,1,3,6],[14,4,14,5],[15,4,15,5],[16,4,16,5],[17,4,17,5],[18,4,18,5],[19,4,19,5],[20,4,20,5],[21,4,21,5],[12,4,12,5],[6,1,6,6],[7,4,7,5],[8,4,8,5],[22,4,22,5],[24,1,24,3],[4,2,4,3],[4,5,4,6],[5,2,5,3],[5,5,5,6],[2,1,2,3],[2,4,2,6]]}
["급여명세서(근로소득/사업소득) (자동 정산서식)"]
[]
[null,{"$f":"'급여대장(입력)'!B3","v":"2021년 8월"},null,null,"급여명세서"]
[]
[null,"사원명","오",null,"계약구분","지입"]
[null,"귀속연월",{"$f":"'급여대장(입력)'!B3","v":"2021년 8월"},null,"직책","SM"]
[]
[null,"지\n\n급\n\n내\n\n역","기본급",0,"연장근로수당"]
[null,null,"식대",null,"근속수당"]
[null,null,"개발수수료",null,"직책수당",null,100000]
{"$rows_left_out":18}
{"sheet":"4대보험료 계산","index":3,"n_rows":52,"n_cols":26,"rows_kept":52,"cut":false,"hidden":false,"merged":[[39,3,40,3],[36,3,36,4],[37,3,37,4],[38,3,38,4],[36,2,40,2],[36,5,36,9],[37,5,37,9],[38,5,38,9],[39,5,39,9],[40,5,40,9],[34,1,34,2],[4,8,4,9],[4,10,5,10],[3,1,5,1],[3,2,5,2],[3,3,3,5],[3,6,3,10],[4,3,5,3],[4,4,5,4],[4,5,5,5],[4,6,4,7],[3,20,3,25],[4,20,4,22],[4,23,4,25],[4,15,5,15],[37,11,37,13],[37,14,37,15],[3,11,3,15],[4,19,5,19],[3,16,3,19],[4,17,4,18],[36,18,36,19],[37,18,37,19],[4,11,4,12],[4,13,4,14],[48,2,51,2],[48,3,48,4],[48,5,48,9],[49,3,49,4],[49,5,49,9],[50,3,50,4],[50,5,50,9],[51,5,51,9],[51,3,51,4],[42,2,46,2],[42,3,42,4],[42,5,42,9],[43,3,43,4],[43,5,43,9],[44,3,44,4],[44,5,44,9],[45,3,46,3],[45,5,45,9],[46,5,46,9],[38,18,38,19],[39,18,39,19],[40,18,40,19],[40,14,40,15],[36,11,36,13],[36,14,36,15],[36,16,36,17],[37,16,37,17],[38,16,38,17],[39,16,39,17],[40,16,40,17],[39,11,39,13],[39,14,39,15],[40,11,40,13],[38,11,38,13],[38,14,38,15]]}
["4대 사회보험료 내역서 (자동 정산서식/입력 금지)"]
[]
[null,{"$f":"'급여대장(입력)'!B3","v":"2021년 8월"},null,null,null,null,null,null,null,null,null,null,null,null,null,null,null,null,null,null,null,null,null,null,null,"(단위:원, VAT포함)"]
[null,"성명","월소득\n(기준)","국민연금",null,null,"건강보험",null,null,null,null,"고용보험",null,null,null,null,"산재보험",null,null,null,"4대보험료 합계"]
[null,null,null,"회사","근로자","합계","회사",null,"근로자",null,"합계","근로자(고용보험+직무개발)",null,"특고직",null,"합계","근로자","특고직",null,"합계","근로자",null,null,"특고직"]
[null,null,null,null,null,null,"건강보험료","장기요양보험","건강보험료","장기요양보험",null,"회사","근로자","회사","특고직",null,"회사","회사","특고직",null,"회사","근로자","합계","회사","특고직","합계"]
[null,{"$f":"표1[[#This Row],[사원명]]","v":"홍길동"},{"$f":"'급여대장(입력)'!V6-100000","v":2900000},{"$f":"E7","v":130500},{"$f":"'급여대장(입력)'!Y6","v":130500},{"$f":"SUM(D7:E7)","v":261000},{"$f":"'급여대장(입력)'!Z6","v":99470},{"$f":"'급여대장(입력)'!AA6","v":11458},{"$f":"G7","v":99470},{"$f":"H7","v":11458},{"$f":"SUM(G7:J7)","v":221856},{"$f":"((M7/0.8%)*1.05%)","v":30450.000000000004},{"$f":"'급여대장(입력)'!AB6","v":23200},{"$f":"O7","v":""},{"$f":"'급여대장(입력)'!AC6","v":""},{"$f":"SUM(L7:O7)","v":53650},{"$f":"IF('급여대장(입력)'!E6=\"직영\",((C7*19.63)/1000),\"\")","v":""},{"$f":"S7","v":""},{"$f":"IF('급여대장(입력)'!E6=\"지입\",11495,\"\")","v":""},{"$f":"SUM(Q7:S7)","v":0},{"$f":"D7+G7+H7+L7","v":271878},{"$f":"E7+I7+J7+M7","v":264628},{"$f":"U7+V7","v":536506},null,null,{"$f":"X7+Y7","v":0}]
[null,{"$f":"표1[[#This Row],[사원명]]","v":"아무개"},{"$f":"'급여대장(입력)'!V7-100000","v":2800000},126000,{"$f":"'급여대장(입력)'!Y7","v":126000},{"$f":"SUM(D8:E8)","v":252000},{"$f":"'급여대장(입력)'!Z7","v":96040},{"$f":"'급여대장(입력)'!AA7","v":11063},{"$f":"G8","v":96040},{"$f":"H8","v":11063},{"$f":"SUM(G8:J8)","v":214206},{"$f":"((M8/0.8%)*1.05%)","v":29400.000000000004},{"$f":"'급여대장(입력)'!AB7","v":22400},"",{"$f":"'급여대장(입력)'!AC7","v":""},{"$f":"SUM(L8:O8)","v":51800},{"$f":"IF('급여대장(입력)'!E7=\"직영\",((C8*19.63)/1000),\"\")","v":""},"",{"$f":"IF('급여대장(입력)'!E7=\"지입\",11495,\"\")","v":""},0,{"$f":"D8+G8+H8+L8","v":262503},{"$f":"E8+I8+J8+M8","v":255503},{"$f":"U8+V8","v":518006},null,null,0]
[null,{"$f":"표1[[#This Row],[사원명]]","v":"김"},{"$f":"'급여대장(입력)'!V8-100000","v":3900000},175500,{"$f":"'급여대장(입력)'!Y8","v":175500},351000,{"$f":"'급여대장(입력)'!Z8","v":133770},{"$f":"'급여대장(입력)'!AA8","v":15410},{"$f":"G9","v":133770},{"$f":"H9","v":15410},298360,{"$f":"((M9/0.8%)*1.05%)","v":40950},{"$f":"'급여대장(입력)'!AB8","v":31200},"",{"$f":"'급여대장(입력)'!AC8","v":""},{"$f":"SUM(L9:O9)","v":72150},{"$f":"IF('급여대장(입력)'!E8=\"직영\",((C9*19.63)/1000),\"\")","v":76557},"",{"$f":"IF('급여대장(입력)'!E8=\"지입\",11495,\"\")","v":""},{"$f":"SUM(Q9:S9)","v":76557},{"$f":"D9+G9+H9+L9","v":365630},{"$f":"E9+I9+J9+M9","v":355880},{"$f":"U9+V9","v":721510},null,null,0]
[null,{"$f":"표1[[#This Row],[사원명]]","v":"이"},{"$f":"'급여대장(입력)'!V9-100000","v":3800000},{"$f":"E10","v":171000},{"$f":"'급여대장(입력)'!Y9","v":171000},342000,{"$f":"'급여대장(입력)'!Z9","v":130340},{"$f":"'급여대장(입력)'!AA9","v":15015},130340,15015,290710,39900,{"$f":"'급여대장(입력)'!AB9","v":30400},"",{"$f":"'급여대장(입력)'!AC9","v":""},70300,{"$f":"IF('급여대장(입력)'!E9=\"직영\",((C10*19.63)/1000),\"\")","v":74594},"",{"$f":"IF('급여대장(입력)'!E9=\"지입\",11495,\"\")","v":""},74594,356255,346755,703010,null,null,0]
{"$rows_left_out":43}
{"sheet":"2021_근로소득간이세액표","index":4,"n_rows":664,"n_cols":13,"rows_kept":664,"cut":false,"hidden":false,"merged":[[659,0,659,1],[0,0,0,12],[1,0,1,12],[2,0,2,1],[2,2,2,12],[3,0,3,1],[651,0,651,1],[660,2,661,12],[661,0,661,1],[662,0,662,1],[662,2,662,12],[652,0,652,1],[652,2,653,12],[653,0,653,1],[654,0,654,1],[654,2,655,12],[655,0,655,1],[656,0,656,1],[656,2,657,12],[657,0,657,1],[660,0,660,1],[658,0,658,1],[658,2,659,12]]}
["근로소득 간이세액표(제189조 제1항 관련)"]
["(단위: 원)"]
["월급여액(천원)",null,"공제대상가족의 수"]
["[비과세 및 학자금 제외］",null,1,2,3,4,5,6,7,8,9,10,11]
["이상","미만"]
[770,775,"-","-","-","-","-","-","-","-","-","-","-"]
[775,780,"-","-","-","-","-","-","-","-","-","-","-"]
[780,785,"-","-","-","-","-","-","-","-","-","-","-"]
[785,790,"-","-","-","-","-","-","-","-","-","-","-"]
[790,795,"-","-","-","-","-","-","-","-","-","-","-"]
{"$rows_left_out":655}
{"sheet":"option","index":5,"n_rows":306,"n_cols":32,"rows_kept":306,"cut":false,"hidden":true,"merged":[]}
["과세","항목",1,2,3,4,5,6,7,8,9,10,11,12,13,14,15]
["비과세","과세",0,1,0,0,0,0,0,0,0,0,0,0,0,0,0]
[null,"절사단위",0,0,0,0,0,0]
["직접입력"]
["소득세",null,null,null,null,null,null,null,null,null,null,null,null,null,null,null,null,null,"5. 지급액 상위 5인"]
["지방소득세",null,"1. 사원별 급여 통계비교",null,null,"0.사원 급여 통계",null,null,null,null,null,null,null,null,null,null,null,null,null,"사원명","지급합계","랭크","랭크보정","기본급","기본급 외 수당","랭크","랭크보정",null,"지급액 상위 5인찾기","지급액합계","기본급","기본급 외 지급액"]
["국민연금",null,3,15,null,1,"직급",null,null,null,null,null,null,null,null,null,null,null,1,{"$f":"'급여대장(입력)'!C6","v":"홍길동"},{"$f":"_xlfn.IFNA(VLOOKUP(T7,'급여대장(입력)'!$C$6:$V$22,20,0),0)","v":3000000},{"$f":"RANK(U7,$U$7:$U$306)","v":{"$error":"#REF!"}},{"$f":"$V7+COUNTIFS($V$7:$V$306,$V7,$S$7:$S$306,\"<\"&S7)","v":{"$error":"#REF!"}},{"$f":"IFERROR(VLOOKUP(T7,표1[[사원명]:[열3]],11,0),0)","v":0},{"$f":"U7-X7","v":3000000},{"$f":"RANK(Y7,$Y$7:$Y$306)","v":{"$error":"#REF!"}},{"$f":"$Z7+COUNTIFS($Z$7:$Z$306,$Z7,$S$7:$S$306,\"<\"&S7)","v":{"$error":"#REF!"}},null,{"$f":"INDEX($S$7:$W$60,MATCH(1,$W$7:$W$60,0),2)","v":{"$error":"#N/A"}},{"$f":"VLOOKUP(AC7,$T:$U,2,0)","v":{"$error":"#N/A"}},{"$f":"IFERROR(VLOOKUP(AC7,'급여대장(입력)'!$C$6:$G$282,5,0),0)","v":0},{"$f":"AD7-AE7","v":{"$error":"#N/A"}}]
["건강보험",null,{"$f":"OFFSET(표1[[#Headers],[사원명]],option!$C$7,0)","v":"김"},{"$f":"OFFSET(표1[[#Headers],[사원명]],option!$D$7,0)","v":0},null,{"$f":"OFFSET(표1[[#Headers],[사원명]],option!$F$7,0)","v":"홍길동"},{"$f":"_xlfn.IFNA(VLOOKUP(F8,표1[[사원명]:[직책]],4,0),\"\")","v":"OP"},null,null,null,null,null,null,null,null,null,null,null,2,{"$f":"'급여대장(입력)'!C7","v":"아무개"},{"$f":"_xlfn.IFNA(VLOOKUP(T8,'급여대장(입력)'!$C$6:$V$22,20,0),0)","v":2900000},{"$f":"RANK(U8,$U$7:$U$306)","v":{"$error":"#REF!"}},{"$f":"$V8+COUNTIFS($V$7:$V$306,$V8,$S$7:$S$306,\"<\"&S8)","v":{"$error":"#REF!"}},{"$f":"IFERROR(VLOOKUP(T8,표1[[사원명]:[열3]],11,0),0)","v":0},{"$f":"U8-X8","v":2900000},{"$f":"RANK(Y8,$Y$7:$Y$306)","v":{"$error":"#REF!"}},{"$f":"$Z8+COUNTIFS($Z$7:$Z$306,$Z8,$S$7:$S$306,\"<\"&S8)","v":{"$error":"#REF!"}},null,{"$f":"INDEX($S$7:$W$60,MATCH(2,$W$7:$W$60,0),2)","v":{"$error":"#N/A"}},{"$f":"VLOOKUP(AC8,$T:$U,2,0)","v":{"$error":"#N/A"}},{"$f":"IFERROR(VLOOKUP(AC8,'급여대장(입력)'!$C$6:$G$282,5,0),0)","v":0},{"$f":"AD8-AE8","v":{"$error":"#N/A"}}]
["노인장기요양",null,null,null,null,null,null,null,null,null,null,null,null,null,null,null,null,null,3,{"$f":"'급여대장(입력)'!C8","v":"김"},{"$f":"_xlfn.IFNA(VLOOKUP(T9,'급여대장(입력)'!$C$6:$V$22,20,0),0)","v":4000000},{"$error":"#REF!"},{"$error":"#REF!"},{"$f":"IFERROR(VLOOKUP(T9,표1[[사원명]:[열3]],11,0),0)","v":0},4000000,{"$error":"#REF!"},{"$error":"#REF!"},null,{"$f":"INDEX($S$7:$W$60,MATCH(3,$W$7:$W$60,0),2)","v":{"$error":"#N/A"}},{"$error":"#N/A"},{"$f":"IFERROR(VLOOKUP(AC9,'급여대장(입력)'!$C$6:$G$282,5,0),0)","v":0},{"$error":"#N/A"}]
["고용보험",null,null,null,null,null,null,null,null,null,null,null,null,null,null,null,null,null,4,{"$f":"'급여대장(입력)'!C9","v":"이"},{"$f":"_xlfn.IFNA(VLOOKUP(T10,'급여대장(입력)'!$C$6:$V$22,20,0),0)","v":3900000},{"$error":"#REF!"},{"$error":"#REF!"},{"$f":"IFERROR(VLOOKUP(T10,표1[[사원명]:[열3]],11,0),0)","v":0},3900000,{"$error":"#REF!"},{"$error":"#REF!"},null,{"$f":"INDEX($S$7:$W$60,MATCH(4,$W$7:$W$60,0),2)","v":{"$error":"#N/A"}},{"$error":"#N/A"},{"$f":"IFERROR(VLOOKUP(AC10,'급여대장(입력)'!$C$6:$G$282,5,0),0)","v":0},{"$error":"#N/A"}]
{"$rows_left_out":296}