{"text_format":"1","workbook":"xlsx","n_sheets":6,"sheets":["사원정보(입력)","급여대장(입력)","급여명세서","4대보험료 계산","2021_근로소득간이세액표","option"],"not_rendered":{"charts":0,"images":6,"macros":1,"external_links":0,"defined_names":13,"comments":2,"pivot_tables":0},"unopened":[],"bounds":{"document_bytes":16777216,"sheet_cells":100000,"rows_first":2000,"rows_last":500,"rows_between":2000,"halvings":0,"cell_chars":16384,"cell_head_chars":4096},"cells_cut":0,"cells_raw":0,"read":"whole","date_system":"1900"}

{"sheet":"사원정보(입력)","index":0,"n_rows":14,"n_cols":26,"rows_kept":14,"cut":false,"hidden":false,"merged":[[2,1,3,1],[5,20,5,21]]}
["직원(사무직, 직영 및 지입 택배기사) 현황표"]
[]
[null,"사원\n현황","등록 ","재직","퇴사"]
[null,null,{"$f":"D4+E4","v":8},{"$f":"COUNTIF(표1[상태],\"재직\")","v":8},{"$f":"COUNTIF(표1[상태],\"퇴사\")","v":0}]
[]
[null,"사원명","사원번호","계약구분","직책","상태","입사일\n(yyyy-mm-dd)","퇴사일\n(yyyy-mm-dd)","급여계좌","부양가족","20세이하\n자녀","열3","열1","열2","국민연금","건강보험","노인장기\n요양보험","고용보험","소득세",null,"4대보험 요율(%)",null,"상한액","하한액"]
[null,"홍길동","lgl600001",null,"OP","재직",null,null,null,2,1,null,null,null,"1) 공제","1) 공제","1) 공제","1) 공제","1) 일반_100%",null," 국민연금_근로자분",4.5,226350,14400]
[null,"아무개",600002,null,"OP","재직",null,null,null,1,null,null,null,null,"1) 공제","1) 공제","1) 공제","1) 공제","1) 일반_100%",null," 건강보험_근로자분",3.43,3322170,9300]
[null,"김",600003,"직영","SM","재직",null,null,null,2,1,null,null,null,"1) 공제","1) 공제","1) 공제","1) 공제","1) 일반_100%",null," 노인장기요양_근로자분",11.52]
[null,"이",600004,"직영","SM","재직",null,null,null,1,null,null,null,null,"1) 공제","1) 공제","1) 공제","1) 공제","1) 일반_100%",null," 고용보험_근로자분",0.8]
[null,"박",600005,"직영","SM","재직",null,null,null,2,null,null,null,null,"1) 공제","1) 공제","1) 공제","1) 공제","1) 일반_100%",null," 고용보험_특고직",0.7]
[null,"오",600006,"지입","SM","재직",null,null,null,2,1,null,null,null,null,null,null,null,null,null," 산재보험_특고직",0.95,null,null,null,"책정 기준급여 : 242만원 (2023.6월한 한시적으로 50% 감면)"]
[null,"최",600007,"지입","SM","재직",null,null,null,1,null,null,null,null,null,null,null,null,null,null," 사업소득",3.3]
[null,"권",600008,"지입","SM","재직",null,null,null,2,null,null,null,null,null,null,null,null,null,null," 기타소득",8.8000000000000007]

{"sheet":"급여대장(입력)","index":1,"n_rows":36,"n_cols":39,"rows_kept":36,"cut":false,"hidden":false,"merged":[[35,1,35,5],[3,22,3,37],[3,38,4,38],[3,6,3,21],[3,1,3,5]]}
["급여대장(근로소득/사업소득)  Pay Management"]
[]
[null,"2021년 8월",null,null,null,null,null,null,null,null,null,null,null,null,null,null,null,null,null,null,null,null,null,null,null,null,null,null,null,null,null,null,null,null,null,null,null,null,"(단위:원, VAT포함)"]
[null,"사원현황",null,null,null,null,"지급 금액",null,null,null,null,null,null,null,null,null,null,null,null,null,null,null,"공제 금액",null,null,null,null,null,null,null,null,null,null,null,null,null,null,null,"지급액"]
[null,"번호","사원명","사원번호","계약구분","직책","기본급","식대","개발수수료","집하수수료","배송수수료","분류비","유류지원금","교통비","연장근로수당","근속수당","직책수당","","","","","지급합계","소득세","지방소득세","국민연금","건강보험","노인장기요양","고용보험(근로)","고용보험(특고)","산재보험(특고)","운송장","포장 테이프","전산장비","화물사고 분담","","","","공제합계"]
[null,1,{"$f":"'사원정보(입력)'!B7","v":"홍길동"},{"$f":"IFERROR(VLOOKUP(C6,표1[],2,0),\"\")","v":"lgl600001"},{"$f":"IFERROR(VLOOKUP(C6,표1[],3,0),\"\")","v":0},{"$f":"IFERROR(VLOOKUP(C6,표1[],4,0),\"\")","v":"OP"},2500000,100000,null,null,null,null,null,100000,100000,100000,100000,null,null,null,null,{"$f":"SUM(G6:U6)","v":3000000},{"$f":"IF(LEN(C6)=0,0,IFERROR(IF(LEN(VLOOKUP(C6,표1[],18,0))=0,0,ROUNDDOWN(CHOOSE(LEFT(VLOOKUP(C6,표1[],18,0),1),INTAX(SUMIF(option!$C$2:$Q$2,0,G6:U6),VLOOKUP(C6,표1[],9,0),VLOOKUP(C6,표1[],10,0)),INTAX(SUMIF(option!$C$2:$Q$2,0,G6:U6),VLOOKUP(C6,표1[],9,0),VLOOKUP(C6,표1[],10,0))*1.2,INTAX(SUMIF(option!$C$2:$Q$2,0,G6:U6),VLOOKUP(C6,표1[],9,0),VLOOKUP(C6,표1[],10,0))*0.8,V6*(('사원정보(입력)'!V$13/1.1)/100),V6*(('사원정보(입력)'!V$14/1.1)/100)),option!$C$3*-1)),0))","v":28480},{"$f":"IF(W6=0,0,ROUNDDOWN(W6*0.1,option!$D$3*-1))","v":2848},{"$f":"IF(LEN(C6)=0,0,IFERROR(ROUNDDOWN(ctax(LEFT(VLOOKUP(C6,표1[],14,0),FIND(\")\",VLOOKUP(C6,표1[],14,0))-1),SUMIF(option!$C$2:$Q$2,0,G6:U6),'사원정보(입력)'!V$7,VLOOKUP(C6,표1[],12,0)),option!$E$3*-1),0))","v":130500},{"$f":"IF(LEN(C6)=0,0,IFERROR(ROUNDDOWN(HTAX(LEFT(VLOOKUP(C6,표1[],15,0),FIND(\")\",VLOOKUP(C6,표1[],15,0))-1),SUMIF(option!$C$2:$Q$2,0,G6:U6),'사원정보(입력)'!V$8,VLOOKUP(C6,표1[],13,0)),option!$F$3*-1),0))","v":99470},{"$f":"IF(Z6=0,0,IF(LEFT(VLOOKUP(C6,표1[],16,0),FIND(\")\",VLOOKUP(C6,표1[],16,0))-1)=\"2\",0,ROUNDDOWN(IF(LEFT(VLOOKUP(C6,표1[],16,0),FIND(\")\",VLOOKUP(C6,표1[],16,0))-1)=\"1\",Z6*('사원정보(입력)'!V$9/100),Z6*('사원정보(입력)'!V$9/100)*(1-((LEFT(VLOOKUP(C6,표1[],16,0),FIND(\")\",VLOOKUP(C6,표1[],16,0))-1)-2)/10))),option!$G$3*-1)))","v":11458},{"$f":"IF(LEN(C6)=0,0,IF(LEFT(VLOOKUP(C6,표1[],17,0),1)=\"2\",0,ROUNDDOWN(SUMIF(option!$C$2:$Q$2,0,G6:U6)*('사원정보(입력)'!V$10/100),option!$H$3*-1)))","v":23200},{"$f":"IF(E6=\"지입\",((V6/1.1)*79.8%)*0.7%,\"\")","v":""},{"$f":"IF(E6=\"지입\",11495,\"\")","v":""},null,null,null,null,null,null,null,{"$f":"SUM(W6:AK6)","v":295956},{"$f":"V6-AL6","v":2704044}]
[null,2,{"$f":"'사원정보(입력)'!B8","v":"아무개"},{"$f":"IFERROR(VLOOKUP(C7,표1[],2,0),\"\")","v":600002},{"$f":"IFERROR(VLOOKUP(C7,표1[],3,0),\"\")","v":0},{"$f":"IFERROR(VLOOKUP(C7,표1[],4,0),\"\")","v":"OP"},2500000,100000,null,null,null,null,null,100000,100000,100000,null,null,null,null,null,2900000,{"$f":"IF(LEN(C7)=0,0,IFERROR(IF(LEN(VLOOKUP(C7,표1[],18,0))=0,0,ROUNDDOWN(CHOOSE(LEFT(VLOOKUP(C7,표1[],18,0),1),INTAX(SUMIF(option!$C$2:$Q$2,0,G7:U7),VLOOKUP(C7,표1[],9,0),VLOOKUP(C7,표1[],10,0)),INTAX(SUMIF(option!$C$2:$Q$2,0,G7:U7),VLOOKUP(C7,표1[],9,0),VLOOKUP(C7,표1[],10,0))*1.2,INTAX(SUMIF(option!$C$2:$Q$2,0,G7:U7),VLOOKUP(C7,표1[],9,0),VLOOKUP(C7,표1[],10,0))*0.8,V7*(('사원정보(입력)'!V$13/1.1)/100),V7*(('사원정보(입력)'!V$14/1.1)/100)),option!$C$3*-1)),0))","v":67300},{"$f":"IF(W7=0,0,ROUNDDOWN(W7*0.1,option!$D$3*-1))","v":6730},{"$f":"IF(LEN(C7)=0,0,IFERROR(ROUNDDOWN(ctax(LEFT(VLOOKUP(C7,표1[],14,0),FIND(\")\",VLOOKUP(C7,표1[],14,0))-1),SUMIF(option!$C$2:$Q$2,0,G7:U7),'사원정보(입력)'!V$7,VLOOKUP(C7,표1[],12,0)),option!$E$3*-1),0))","v":126000},{"$f":"IF(LEN(C7)=0,0,IFERROR(ROUNDDOWN(HTAX(LEFT(VLOOKUP(C7,표1[],15,0),FIND(\")\",VLOOKUP(C7,표1[],15,0))-1),SUMIF(option!$C$2:$Q$2,0,G7:U7),'사원정보(입력)'!V$8,VLOOKUP(C7,표1[],13,0)),option!$F$3*-1),0))","v":96040},{"$f":"IF(Z7=0,0,IF(LEFT(VLOOKUP(C7,표1[],16,0),FIND(\")\",VLOOKUP(C7,표1[],16,0))-1)=\"2\",0,ROUNDDOWN(IF(LEFT(VLOOKUP(C7,표1[],16,0),FIND(\")\",VLOOKUP(C7,표1[],16,0))-1)=\"1\",Z7*('사원정보(입력)'!V$9/100),Z7*('사원정보(입력)'!V$9/100)*(1-((LEFT(VLOOKUP(C7,표1[],16,0),FIND(\")\",VLOOKUP(C7,표1[],16,0))-1)-2)/10))),option!$G$3*-1)))","v":11063},{"$f":"IF(LEN(C7)=0,0,IF(LEFT(VLOOKUP(C7,표1[],17,0),1)=\"2\",0,ROUNDDOWN(SUMIF(option!$C$2:$Q$2,0,G7:U7)*('사원정보(입력)'!V$10/100),option!$H$3*-1)))","v":22400},"","",null,null,null,50000,null,null,null,{"$f":"SUM(W7:AK7)","v":379533},{"$f":"V7-AL7","v":2520467}]
[null,3,{"$f":"'사원정보(입력)'!B9","v":"김"},{"$f":"IFERROR(VLOOKUP(C8,표1[],2,0),\"\")","v":600003},{"$f":"IFERROR(VLOOKUP(C8,표1[],3,0),\"\")","v":"직영"},{"$f":"IFERROR(VLOOKUP(C8,표1[],4,0),\"\")","v":"SM"},3500000,100000,null,null,null,null,null,100000,100000,100000,100000,null,null,null,null,4000000,{"$f":"IF(LEN(C8)=0,0,IFERROR(IF(LEN(VLOOKUP(C8,표1[],18,0))=0,0,ROUNDDOWN(CHOOSE(LEFT(VLOOKUP(C8,표1[],18,0),1),INTAX(SUMIF(option!$C$2:$Q$2,0,G8:U8),VLOOKUP(C8,표1[],9,0),VLOOKUP(C8,표1[],10,0)),INTAX(SUMIF(option!$C$2:$Q$2,0,G8:U8),VLOOKUP(C8,표1[],9,0),VLOOKUP(C8,표1[],10,0))*1.2,INTAX(SUMIF(option!$C$2:$Q$2,0,G8:U8),VLOOKUP(C8,표1[],9,0),VLOOKUP(C8,표1[],10,0))*0.8,V8*(('사원정보(입력)'!V$13/1.1)/100),V8*(('사원정보(입력)'!V$14/1.1)/100)),option!$C$3*-1)),0))","v":112370},{"$f":"IF(W8=0,0,ROUNDDOWN(W8*0.1,option!$D$3*-1))","v":11237},{"$f":"IF(LEN(C8)=0,0,IFERROR(ROUNDDOWN(ctax(LEFT(VLOOKUP(C8,표1[],14,0),FIND(\")\",VLOOKUP(C8,표1[],14,0))-1),SUMIF(option!$C$2:$Q$2,0,G8:U8),'사원정보(입력)'!V$7,VLOOKUP(C8,표1[],12,0)),option!$E$3*-1),0))","v":175500},{"$f":"IF(LEN(C8)=0,0,IFERROR(ROUNDDOWN(HTAX(LEFT(VLOOKUP(C8,표1[],15,0),FIND(\")\",VLOOKUP(C8,표1[],15,0))-1),SUMIF(option!$C$2:$Q$2,0,G8:U8),'사원정보(입력)'!V$8,VLOOKUP(C8,표1[],13,0)),option!$F$3*-1),0))","v":133770},{"$f":"IF(Z8=0,0,IF(LEFT(VLOOKUP(C8,표1[],16,0),FIND(\")\",VLOOKUP(C8,표1[],16,0))-1)=\"2\",0,ROUNDDOWN(IF(LEFT(VLOOKUP(C8,표1[],16,0),FIND(\")\",VLOOKUP(C8,표1[],16,0))-1)=\"1\",Z8*('사원정보(입력)'!V$9/100),Z8*('사원정보(입력)'!V$9/100)*(1-((LEFT(VLOOKUP(C8,표1[],16,0),FIND(\")\",VLOOKUP(C8,표1[],16,0))-1)-2)/10))),option!$G$3*-1)))","v":15410},{"$f":"IF(LEN(C8)=0,0,IF(LEFT(VLOOKUP(C8,표1[],17,0),1)=\"2\",0,ROUNDDOWN(SUMIF(option!$C$2:$Q$2,0,G8:U8)*('사원정보(입력)'!V$10/100),option!$H$3*-1)))","v":31200},"","",null,null,null,null,null,null,null,479487,{"$f":"V8-AL8","v":3520513}]
[null,4,{"$f":"'사원정보(입력)'!B10","v":"이"},{"$f":"IFERROR(VLOOKUP(C9,표1[],2,0),\"\")","v":600004},{"$f":"IFERROR(VLOOKUP(C9,표1[],3,0),\"\")","v":"직영"},{"$f":"IFERROR(VLOOKUP(C9,표1[],4,0),\"\")","v":"SM"},3500000,100000,null,null,null,null,null,100000,100000,100000,null,null,null,null,null,3900000,{"$f":"IF(LEN(C9)=0,0,IFERROR(IF(LEN(VLOOKUP(C9,표1[],18,0))=0,0,ROUNDDOWN(CHOOSE(LEFT(VLOOKUP(C9,표1[],18,0),1),INTAX(SUMIF(option!$C$2:$Q$2,0,G9:U9),VLOOKUP(C9,표1[],9,0),VLOOKUP(C9,표1[],10,0)),INTAX(SUMIF(option!$C$2:$Q$2,0,G9:U9),VLOOKUP(C9,표1[],9,0),VLOOKUP(C9,표1[],10,0))*1.2,INTAX(SUMIF(option!$C$2:$Q$2,0,G9:U9),VLOOKUP(C9,표1[],9,0),VLOOKUP(C9,표1[],10,0))*0.8,V9*(('사원정보(입력)'!V$13/1.1)/100),V9*(('사원정보(입력)'!V$14/1.1)/100)),option!$C$3*-1)),0))","v":184260},{"$f":"IF(W9=0,0,ROUNDDOWN(W9*0.1,option!$D$3*-1))","v":18426},{"$f":"IF(LEN(C9)=0,0,IFERROR(ROUNDDOWN(ctax(LEFT(VLOOKUP(C9,표1[],14,0),FIND(\")\",VLOOKUP(C9,표1[],14,0))-1),SUMIF(option!$C$2:$Q$2,0,G9:U9),'사원정보(입력)'!V$7,VLOOKUP(C9,표1[],12,0)),option!$E$3*-1),0))","v":171000},{"$f":"IF(LEN(C9)=0,0,IFERROR(ROUNDDOWN(HTAX(LEFT(VLOOKUP(C9,표1[],15,0),FIND(\")\",VLOOKUP(C9,표1[],15,0))-1),SUMIF(option!$C$2:$Q$2,0,G9:U9),'사원정보(입력)'!V$8,VLOOKUP(C9,표1[],13,0)),option!$F$3*-1),0))","v":130340},{"$f":"IF(Z9=0,0,IF(LEFT(VLOOKUP(C9,표1[],16,0),FIND(\")\",VLOOKUP(C9,표1[],16,0))-1)=\"2\",0,ROUNDDOWN(IF(LEFT(VLOOKUP(C9,표1[],16,0),FIND(\")\",VLOOKUP(C9,표1[],16,0))-1)=\"1\",Z9*('사원정보(입력)'!V$9/100),Z9*('사원정보(입력)'!V$9/100)*(1-((LEFT(VLOOKUP(C9,표1[],16,0),FIND(\")\",VLOOKUP(C9,표1[],16,0))-1)-2)/10))),option!$G$3*-1)))","v":15015},{"$f":"IF(LEN(C9)=0,0,IF(LEFT(VLOOKUP(C9,표1[],17,0),1)=\"2\",0,ROUNDDOWN(SUMIF(option!$C$2:$Q$2,0,G9:U9)*('사원정보(입력)'!V$10/100),option!$H$3*-1)))","v":30400},"","",null,null,null,null,null,null,null,549441,{"$f":"V9-AL9","v":3350559}]
[null,5,{"$f":"'사원정보(입력)'!B11","v":"박"},{"$f":"IFERROR(VLOOKUP(C10,표1[],2,0),\"\")","v":600005},{"$f":"IFERROR(VLOOKUP(C10,표1[],3,0),\"\")","v":"직영"},{"$f":"IFERROR(VLOOKUP(C10,표1[],4,0),\"\")","v":"SM"},3500000,100000,null,null,null,null,null,100000,100000,null,null,null,null,null,null,3800000,{"$f":"IF(LEN(C10)=0,0,IFERROR(IF(LEN(VLOOKUP(C10,표1[],18,0))=0,0,ROUNDDOWN(CHOOSE(LEFT(VLOOKUP(C10,표1[],18,0),1),INTAX(SUMIF(option!$C$2:$Q$2,0,G10:U10),VLOOKUP(C10,표1[],9,0),VLOOKUP(C10,표1[],10,0)),INTAX(SUMIF(option!$C$2:$Q$2,0,G10:U10),VLOOKUP(C10,표1[],9,0),VLOOKUP(C10,표1[],10,0))*1.2,INTAX(SUMIF(option!$C$2:$Q$2,0,G10:U10),VLOOKUP(C10,표1[],9,0),VLOOKUP(C10,표1[],10,0))*0.8,V10*(('사원정보(입력)'!V$13/1.1)/100),V10*(('사원정보(입력)'!V$14/1.1)/100)),option!$C$3*-1)),0))","v":141670},{"$f":"IF(W10=0,0,ROUNDDOWN(W10*0.1,option!$D$3*-1))","v":14167},{"$f":"IF(LEN(C10)=0,0,IFERROR(ROUNDDOWN(ctax(LEFT(VLOOKUP(C10,표1[],14,0),FIND(\")\",VLOOKUP(C10,표1[],14,0))-1),SUMIF(option!$C$2:$Q$2,0,G10:U10),'사원정보(입력)'!V$7,VLOOKUP(C10,표1[],12,0)),option!$E$3*-1),0))","v":166500},{"$f":"IF(LEN(C10)=0,0,IFERROR(ROUNDDOWN(HTAX(LEFT(VLOOKUP(C10,표1[],15,0),FIND(\")\",VLOOKUP(C10,표1[],15,0))-1),SUMIF(option!$C$2:$Q$2,0,G10:U10),'사원정보(입력)'!V$8,VLOOKUP(C10,표1[],13,0)),option!$F$3*-1),0))","v":126910},{"$f":"IF(Z10=0,0,IF(LEFT(VLOOKUP(C10,표1[],16,0),FIND(\")\",VLOOKUP(C10,표1[],16,0))-1)=\"2\",0,ROUNDDOWN(IF(LEFT(VLOOKUP(C10,표1[],16,0),FIND(\")\",VLOOKUP(C10,표1[],16,0))-1)=\"1\",Z10*('사원정보(입력)'!V$9/100),Z10*('사원정보(입력)'!V$9/100)*(1-((LEFT(VLOOKUP(C10,표1[],16,0),FIND(\")\",VLOOKUP(C10,표1[],16,0))-1)-2)/10))),option!$G$3*-1)))","v":14620},{"$f":"IF(LEN(C10)=0,0,IF(LEFT(VLOOKUP(C10,표1[],17,0),1)=\"2\",0,ROUNDDOWN(SUMIF(option!$C$2:$Q$2,0,G10:U10)*('사원정보(입력)'!V$10/100),option!$H$3*-1)))","v":29600},"","",null,null,null,null,null,null,null,493467,{"$f":"V10-AL10","v":3306533}]
[null,6,{"$f":"'사원정보(입력)'!B12","v":"오"},{"$f":"IFERROR(VLOOKUP(C11,표1[],2,0),\"\")","v":600006},{"$f":"IFERROR(VLOOKUP(C11,표1[],3,0),\"\")","v":"지입"},{"$f":"IFERROR(VLOOKUP(C11,표1[],4,0),\"\")","v":"SM"},{"$f":"IFERROR(VLOOKUP(C11,표1[],11,0),0)","v":0},null,null,1000000,3000000,350000,null,null,null,null,100000,null,null,null,null,{"$f":"SUM(G11:U11)","v":4450000},{"$f":"IF(LEN(C11)=0,0,IFERROR(IF(LEN(VLOOKUP(C11,표1[],18,0))=0,0,ROUNDDOWN(CHOOSE(LEFT(VLOOKUP(C11,표1[],18,0),1),INTAX(SUMIF(option!$C$2:$Q$2,0,G11:U11),VLOOKUP(C11,표1[],9,0),VLOOKUP(C11,표1[],10,0)),INTAX(SUMIF(option!$C$2:$Q$2,0,G11:U11),VLOOKUP(C11,표1[],9,0),VLOOKUP(C11,표1[],10,0))*1.2,INTAX(SUMIF(option!$C$2:$Q$2,0,G11:U11),VLOOKUP(C11,표1[],9,0),VLOOKUP(C11,표1[],10,0))*0.8,V11*(('사원정보(입력)'!V$13/1.1)/100),V11*(('사원정보(입력)'!V$14/1.1)/100)),option!$C$3*-1)),0))","v":0},{"$f":"IF(W11=0,0,ROUNDDOWN(W11*0.1,option!$D$3*-1))","v":0},{"$f":"IF(LEN(C11)=0,0,IFERROR(ROUNDDOWN(ctax(LEFT(VLOOKUP(C11,표1[],14,0),FIND(\")\",VLOOKUP(C11,표1[],14,0))-1),SUMIF(option!$C$2:$Q$2,0,G11:U11),'사원정보(입력)'!V$7,VLOOKUP(C11,표1[],12,0)),option!$E$3*-1),0))","v":0},{"$f":"IF(LEN(C11)=0,0,IFERROR(ROUNDDOWN(HTAX(LEFT(VLOOKUP(C11,표1[],15,0),FIND(\")\",VLOOKUP(C11,표1[],15,0))-1),SUMIF(option!$C$2:$Q$2,0,G11:U11),'사원정보(입력)'!V$8,VLOOKUP(C11,표1[],13,0)),option!$F$3*-1),0))","v":0},{"$f":"IF(Z11=0,0,IF(LEFT(VLOOKUP(C11,표1[],16,0),FIND(\")\",VLOOKUP(C11,표1[],16,0))-1)=\"2\",0,ROUNDDOWN(IF(LEFT(VLOOKUP(C11,표1[],16,0),FIND(\")\",VLOOKUP(C11,표1[],16,0))-1)=\"1\",Z11*('사원정보(입력)'!V$9/100),Z11*('사원정보(입력)'!V$9/100)*(1-((LEFT(VLOOKUP(C11,표1[],16,0),FIND(\")\",VLOOKUP(C11,표1[],16,0))-1)-2)/10))),option!$G$3*-1)))","v":0},null,{"$f":"IF(E11=\"지입\",((V11/1.1)*79.8%)*0.7%,\"\")","v":22597.909090909085},{"$f":"IF(E11=\"지입\",11495,\"\")","v":11495},100000,50000,null,300000,null,null,null,{"$f":"SUM(W11:AK11)","v":484092.90909090906},{"$f":"V11-AL11","v":3965907.0909090908}]
[null,7,{"$f":"'사원정보(입력)'!B13","v":"최"},{"$f":"IFERROR(VLOOKUP(C12,표1[],2,0),\"\")","v":600007},{"$f":"IFERROR(VLOOKUP(C12,표1[],3,0),\"\")","v":"지입"},{"$f":"IFERROR(VLOOKUP(C12,표1[],4,0),\"\")","v":"SM"},null,null,null,1000000,3000000,350000,null,100000,100000,100000,100000,null,null,null,null,4750000,{"$f":"IF(LEN(C12)=0,0,IFERROR(IF(LEN(VLOOKUP(C12,표1[],18,0))=0,0,ROUNDDOWN(CHOOSE(LEFT(VLOOKUP(C12,표1[],18,0),1),INTAX(SUMIF(option!$C$2:$Q$2,0,G12:U12),VLOOKUP(C12,표1[],9,0),VLOOKUP(C12,표1[],10,0)),INTAX(SUMIF(option!$C$2:$Q$2,0,G12:U12),VLOOKUP(C12,표1[],9,0),VLOOKUP(C12,표1[],10,0))*1.2,INTAX(SUMIF(option!$C$2:$Q$2,0,G12:U12),VLOOKUP(C12,표1[],9,0),VLOOKUP(C12,표1[],10,0))*0.8,V12*(('사원정보(입력)'!V$13/1.1)/100),V12*(('사원정보(입력)'!V$14/1.1)/100)),option!$C$3*-1)),0))","v":0},{"$f":"IF(W12=0,0,ROUNDDOWN(W12*0.1,option!$D$3*-1))","v":0},{"$f":"IF(LEN(C12)=0,0,IFERROR(ROUNDDOWN(ctax(LEFT(VLOOKUP(C12,표1[],14,0),FIND(\")\",VLOOKUP(C12,표1[],14,0))-1),SUMIF(option!$C$2:$Q$2,0,G12:U12),'사원정보(입력)'!V$7,VLOOKUP(C12,표1[],12,0)),option!$E$3*-1),0))","v":0},{"$f":"IF(LEN(C12)=0,0,IFERROR(ROUNDDOWN(HTAX(LEFT(VLOOKUP(C12,표1[],15,0),FIND(\")\",VLOOKUP(C12,표1[],15,0))-1),SUMIF(option!$C$2:$Q$2,0,G12:U12),'사원정보(입력)'!V$8,VLOOKUP(C12,표1[],13,0)),option!$F$3*-1),0))","v":0},{"$f":"IF(Z12=0,0,IF(LEFT(VLOOKUP(C12,표1[],16,0),FIND(\")\",VLOOKUP(C12,표1[],16,0))-1)=\"2\",0,ROUNDDOWN(IF(LEFT(VLOOKUP(C12,표1[],16,0),FIND(\")\",VLOOKUP(C12,표1[],16,0))-1)=\"1\",Z12*('사원정보(입력)'!V$9/100),Z12*('사원정보(입력)'!V$9/100)*(1-((LEFT(VLOOKUP(C12,표1[],16,0),FIND(\")\",VLOOKUP(C12,표1[],16,0))-1)-2)/10))),option!$G$3*-1)))","v":0},null,24121.363636363625,11495,null,50000,null,100000,null,null,null,185616.36363636362,4564383.6363636367]
[null,8,{"$f":"'사원정보(입력)'!B14","v":"권"},{"$f":"IFERROR(VLOOKUP(C13,표1[],2,0),\"\")","v":600008},{"$f":"IFERROR(VLOOKUP(C13,표1[],3,0),\"\")","v":"지입"},{"$f":"IFERROR(VLOOKUP(C13,표1[],4,0),\"\")","v":"SM"},null,null,null,1000000,3000000,350000,300000,null,100000,100000,null,null,null,null,null,4850000,{"$f":"IF(LEN(C13)=0,0,IFERROR(IF(LEN(VLOOKUP(C13,표1[],18,0))=0,0,ROUNDDOWN(CHOOSE(LEFT(VLOOKUP(C13,표1[],18,0),1),INTAX(SUMIF(option!$C$2:$Q$2,0,G13:U13),VLOOKUP(C13,표1[],9,0),VLOOKUP(C13,표1[],10,0)),INTAX(SUMIF(option!$C$2:$Q$2,0,G13:U13),VLOOKUP(C13,표1[],9,0),VLOOKUP(C13,표1[],10,0))*1.2,INTAX(SUMIF(option!$C$2:$Q$2,0,G13:U13),VLOOKUP(C13,표1[],9,0),VLOOKUP(C13,표1[],10,0))*0.8,V13*(('사원정보(입력)'!V$13/1.1)/100),V13*(('사원정보(입력)'!V$14/1.1)/100)),option!$C$3*-1)),0))","v":0},{"$f":"IF(W13=0,0,ROUNDDOWN(W13*0.1,option!$D$3*-1))","v":0},{"$f":"IF(LEN(C13)=0,0,IFERROR(ROUNDDOWN(ctax(LEFT(VLOOKUP(C13,표1[],14,0),FIND(\")\",VLOOKUP(C13,표1[],14,0))-1),SUMIF(option!$C$2:$Q$2,0,G13:U13),'사원정보(입력)'!V$7,VLOOKUP(C13,표1[],12,0)),option!$E$3*-1),0))","v":0},{"$f":"IF(LEN(C13)=0,0,IFERROR(ROUNDDOWN(HTAX(LEFT(VLOOKUP(C13,표1[],15,0),FIND(\")\",VLOOKUP(C13,표1[],15,0))-1),SUMIF(option!$C$2:$Q$2,0,G13:U13),'사원정보(입력)'!V$8,VLOOKUP(C13,표1[],13,0)),option!$F$3*-1),0))","v":0},{"$f":"IF(Z13=0,0,IF(LEFT(VLOOKUP(C13,표1[],16,0),FIND(\")\",VLOOKUP(C13,표1[],16,0))-1)=\"2\",0,ROUNDDOWN(IF(LEFT(VLOOKUP(C13,표1[],16,0),FIND(\")\",VLOOKUP(C13,표1[],16,0))-1)=\"1\",Z13*('사원정보(입력)'!V$9/100),Z13*('사원정보(입력)'!V$9/100)*(1-((LEFT(VLOOKUP(C13,표1[],16,0),FIND(\")\",VLOOKUP(C13,표1[],16,0))-1)-2)/10))),option!$G$3*-1)))","v":0},null,{"$f":"IF(E13=\"지입\",((V13/1.1)*79.8%)*0.7%,\"\")","v":24629.181818181816},11495,100000,50000,null,200000,null,null,null,386124.18181818182,4463875.8181818184]
[null,9,{"$f":"'사원정보(입력)'!B15","v":0},{"$f":"IFERROR(VLOOKUP(C14,표1[],2,0),\"\")","v":""},{"$f":"IFERROR(VLOOKUP(C14,표1[],3,0),\"\")","v":""},{"$f":"IFERROR(VLOOKUP(C14,표1[],4,0),\"\")","v":""},null,null,null,null,null,null,null,null,null,null,null,null,null,null,null,0,{"$f":"IF(LEN(C14)=0,0,IFERROR(IF(LEN(VLOOKUP(C14,표1[],18,0))=0,0,ROUNDDOWN(CHOOSE(LEFT(VLOOKUP(C14,표1[],18,0),1),INTAX(SUMIF(option!$C$2:$Q$2,0,G14:U14),VLOOKUP(C14,표1[],9,0),VLOOKUP(C14,표1[],10,0)),INTAX(SUMIF(option!$C$2:$Q$2,0,G14:U14),VLOOKUP(C14,표1[],9,0),VLOOKUP(C14,표1[],10,0))*1.2,INTAX(SUMIF(option!$C$2:$Q$2,0,G14:U14),VLOOKUP(C14,표1[],9,0),VLOOKUP(C14,표1[],10,0))*0.8,V14*(('사원정보(입력)'!V$13/1.1)/100),V14*(('사원정보(입력)'!V$14/1.1)/100)),option!$C$3*-1)),0))","v":0},{"$f":"IF(W14=0,0,ROUNDDOWN(W14*0.1,option!$D$3*-1))","v":0},{"$f":"IF(LEN(C14)=0,0,IFERROR(ROUNDDOWN(ctax(LEFT(VLOOKUP(C14,표1[],14,0),FIND(\")\",VLOOKUP(C14,표1[],14,0))-1),SUMIF(option!$C$2:$Q$2,0,G14:U14),'사원정보(입력)'!V$7,VLOOKUP(C14,표1[],12,0)),option!$E$3*-1),0))","v":0},{"$f":"IF(LEN(C14)=0,0,IFERROR(ROUNDDOWN(HTAX(LEFT(VLOOKUP(C14,표1[],15,0),FIND(\")\",VLOOKUP(C14,표1[],15,0))-1),SUMIF(option!$C$2:$Q$2,0,G14:U14),'사원정보(입력)'!V$8,VLOOKUP(C14,표1[],13,0)),option!$F$3*-1),0))","v":0},{"$f":"IF(Z14=0,0,IF(LEFT(VLOOKUP(C14,표1[],16,0),FIND(\")\",VLOOKUP(C14,표1[],16,0))-1)=\"2\",0,ROUNDDOWN(IF(LEFT(VLOOKUP(C14,표1[],16,0),FIND(\")\",VLOOKUP(C14,표1[],16,0))-1)=\"1\",Z14*('사원정보(입력)'!V$9/100),Z14*('사원정보(입력)'!V$9/100)*(1-((LEFT(VLOOKUP(C14,표1[],16,0),FIND(\")\",VLOOKUP(C14,표1[],16,0))-1)-2)/10))),option!$G$3*-1)))","v":0},{"$f":"IF(LEN(C14)=0,0,IF(LEFT(VLOOKUP(C14,표1[],17,0),1)=\"2\",0,ROUNDDOWN(SUMIF(option!$C$2:$Q$2,0,G14:U14)*('사원정보(입력)'!V$10/100),option!$H$3*-1)))","v":{"$error":"#N/A"}},{"$f":"IF(E14=\"지입\",((V14/1.1)*79.8%)*0.7%,\"\")","v":""},{"$f":"IF(E14=\"지입\",11495,\"\")","v":""},null,null,null,null,null,null,null,{"$error":"#N/A"},{"$error":"#N/A"}]
[null,10,{"$f":"'사원정보(입력)'!B16","v":0},{"$f":"IFERROR(VLOOKUP(C15,표1[],2,0),\"\")","v":""},{"$f":"IFERROR(VLOOKUP(C15,표1[],3,0),\"\")","v":""},{"$f":"IFERROR(VLOOKUP(C15,표1[],4,0),\"\")","v":""},null,null,null,null,null,null,null,null,null,null,null,null,null,null,null,0,{"$f":"IF(LEN(C15)=0,0,IFERROR(IF(LEN(VLOOKUP(C15,표1[],18,0))=0,0,ROUNDDOWN(CHOOSE(LEFT(VLOOKUP(C15,표1[],18,0),1),INTAX(SUMIF(option!$C$2:$Q$2,0,G15:U15),VLOOKUP(C15,표1[],9,0),VLOOKUP(C15,표1[],10,0)),INTAX(SUMIF(option!$C$2:$Q$2,0,G15:U15),VLOOKUP(C15,표1[],9,0),VLOOKUP(C15,표1[],10,0))*1.2,INTAX(SUMIF(option!$C$2:$Q$2,0,G15:U15),VLOOKUP(C15,표1[],9,0),VLOOKUP(C15,표1[],10,0))*0.8,V15*(('사원정보(입력)'!V$13/1.1)/100),V15*(('사원정보(입력)'!V$14/1.1)/100)),option!$C$3*-1)),0))","v":0},{"$f":"IF(W15=0,0,ROUNDDOWN(W15*0.1,option!$D$3*-1))","v":0},{"$f":"IF(LEN(C15)=0,0,IFERROR(ROUNDDOWN(ctax(LEFT(VLOOKUP(C15,표1[],14,0),FIND(\")\",VLOOKUP(C15,표1[],14,0))-1),SUMIF(option!$C$2:$Q$2,0,G15:U15),'사원정보(입력)'!V$7,VLOOKUP(C15,표1[],12,0)),option!$E$3*-1),0))","v":0},{"$f":"IF(LEN(C15)=0,0,IFERROR(ROUNDDOWN(HTAX(LEFT(VLOOKUP(C15,표1[],15,0),FIND(\")\",VLOOKUP(C15,표1[],15,0))-1),SUMIF(option!$C$2:$Q$2,0,G15:U15),'사원정보(입력)'!V$8,VLOOKUP(C15,표1[],13,0)),option!$F$3*-1),0))","v":0},{"$f":"IF(Z15=0,0,IF(LEFT(VLOOKUP(C15,표1[],16,0),FIND(\")\",VLOOKUP(C15,표1[],16,0))-1)=\"2\",0,ROUNDDOWN(IF(LEFT(VLOOKUP(C15,표1[],16,0),FIND(\")\",VLOOKUP(C15,표1[],16,0))-1)=\"1\",Z15*('사원정보(입력)'!V$9/100),Z15*('사원정보(입력)'!V$9/100)*(1-((LEFT(VLOOKUP(C15,표1[],16,0),FIND(\")\",VLOOKUP(C15,표1[],16,0))-1)-2)/10))),option!$G$3*-1)))","v":0},{"$f":"IF(LEN(C15)=0,0,IF(LEFT(VLOOKUP(C15,표1[],17,0),1)=\"2\",0,ROUNDDOWN(SUMIF(option!$C$2:$Q$2,0,G15:U15)*('사원정보(입력)'!V$10/100),option!$H$3*-1)))","v":{"$error":"#N/A"}},"","",null,null,null,null,null,null,null,{"$error":"#N/A"},{"$error":"#N/A"}]
[null,11,{"$f":"'사원정보(입력)'!B17","v":0},{"$f":"IFERROR(VLOOKUP(C16,표1[],2,0),\"\")","v":""},{"$f":"IFERROR(VLOOKUP(C16,표1[],3,0),\"\")","v":""},{"$f":"IFERROR(VLOOKUP(C16,표1[],4,0),\"\")","v":""},null,null,null,null,null,null,null,null,null,null,null,null,null,null,null,0,{"$f":"IF(LEN(C16)=0,0,IFERROR(IF(LEN(VLOOKUP(C16,표1[],18,0))=0,0,ROUNDDOWN(CHOOSE(LEFT(VLOOKUP(C16,표1[],18,0),1),INTAX(SUMIF(option!$C$2:$Q$2,0,G16:U16),VLOOKUP(C16,표1[],9,0),VLOOKUP(C16,표1[],10,0)),INTAX(SUMIF(option!$C$2:$Q$2,0,G16:U16),VLOOKUP(C16,표1[],9,0),VLOOKUP(C16,표1[],10,0))*1.2,INTAX(SUMIF(option!$C$2:$Q$2,0,G16:U16),VLOOKUP(C16,표1[],9,0),VLOOKUP(C16,표1[],10,0))*0.8,V16*(('사원정보(입력)'!V$13/1.1)/100),V16*(('사원정보(입력)'!V$14/1.1)/100)),option!$C$3*-1)),0))","v":0},{"$f":"IF(W16=0,0,ROUNDDOWN(W16*0.1,option!$D$3*-1))","v":0},{"$f":"IF(LEN(C16)=0,0,IFERROR(ROUNDDOWN(ctax(LEFT(VLOOKUP(C16,표1[],14,0),FIND(\")\",VLOOKUP(C16,표1[],14,0))-1),SUMIF(option!$C$2:$Q$2,0,G16:U16),'사원정보(입력)'!V$7,VLOOKUP(C16,표1[],12,0)),option!$E$3*-1),0))","v":0},{"$f":"IF(LEN(C16)=0,0,IFERROR(ROUNDDOWN(HTAX(LEFT(VLOOKUP(C16,표1[],15,0),FIND(\")\",VLOOKUP(C16,표1[],15,0))-1),SUMIF(option!$C$2:$Q$2,0,G16:U16),'사원정보(입력)'!V$8,VLOOKUP(C16,표1[],13,0)),option!$F$3*-1),0))","v":0},{"$f":"IF(Z16=0,0,IF(LEFT(VLOOKUP(C16,표1[],16,0),FIND(\")\",VLOOKUP(C16,표1[],16,0))-1)=\"2\",0,ROUNDDOWN(IF(LEFT(VLOOKUP(C16,표1[],16,0),FIND(\")\",VLOOKUP(C16,표1[],16,0))-1)=\"1\",Z16*('사원정보(입력)'!V$9/100),Z16*('사원정보(입력)'!V$9/100)*(1-((LEFT(VLOOKUP(C16,표1[],16,0),FIND(\")\",VLOOKUP(C16,표1[],16,0))-1)-2)/10))),option!$G$3*-1)))","v":0},{"$f":"IF(LEN(C16)=0,0,IF(LEFT(VLOOKUP(C16,표1[],17,0),1)=\"2\",0,ROUNDDOWN(SUMIF(option!$C$2:$Q$2,0,G16:U16)*('사원정보(입력)'!V$10/100),option!$H$3*-1)))","v":{"$error":"#N/A"}},"","",null,null,null,null,null,null,null,{"$error":"#N/A"},{"$error":"#N/A"}]
[null,12,{"$f":"'사원정보(입력)'!B18","v":0},{"$f":"IFERROR(VLOOKUP(C17,표1[],2,0),\"\")","v":""},{"$f":"IFERROR(VLOOKUP(C17,표1[],3,0),\"\")","v":""},{"$f":"IFERROR(VLOOKUP(C17,표1[],4,0),\"\")","v":""},null,null,null,null,null,null,null,null,null,null,null,null,null,null,null,0,{"$f":"IF(LEN(C17)=0,0,IFERROR(IF(LEN(VLOOKUP(C17,표1[],18,0))=0,0,ROUNDDOWN(CHOOSE(LEFT(VLOOKUP(C17,표1[],18,0),1),INTAX(SUMIF(option!$C$2:$Q$2,0,G17:U17),VLOOKUP(C17,표1[],9,0),VLOOKUP(C17,표1[],10,0)),INTAX(SUMIF(option!$C$2:$Q$2,0,G17:U17),VLOOKUP(C17,표1[],9,0),VLOOKUP(C17,표1[],10,0))*1.2,INTAX(SUMIF(option!$C$2:$Q$2,0,G17:U17),VLOOKUP(C17,표1[],9,0),VLOOKUP(C17,표1[],10,0))*0.8,V17*(('사원정보(입력)'!V$13/1.1)/100),V17*(('사원정보(입력)'!V$14/1.1)/100)),option!$C$3*-1)),0))","v":0},{"$f":"IF(W17=0,0,ROUNDDOWN(W17*0.1,option!$D$3*-1))","v":0},{"$f":"IF(LEN(C17)=0,0,IFERROR(ROUNDDOWN(ctax(LEFT(VLOOKUP(C17,표1[],14,0),FIND(\")\",VLOOKUP(C17,표1[],14,0))-1),SUMIF(option!$C$2:$Q$2,0,G17:U17),'사원정보(입력)'!V$7,VLOOKUP(C17,표1[],12,0)),option!$E$3*-1),0))","v":0},{"$f":"IF(LEN(C17)=0,0,IFERROR(ROUNDDOWN(HTAX(LEFT(VLOOKUP(C17,표1[],15,0),FIND(\")\",VLOOKUP(C17,표1[],15,0))-1),SUMIF(option!$C$2:$Q$2,0,G17:U17),'사원정보(입력)'!V$8,VLOOKUP(C17,표1[],13,0)),option!$F$3*-1),0))","v":0},{"$f":"IF(Z17=0,0,IF(LEFT(VLOOKUP(C17,표1[],16,0),FIND(\")\",VLOOKUP(C17,표1[],16,0))-1)=\"2\",0,ROUNDDOWN(IF(LEFT(VLOOKUP(C17,표1[],16,0),FIND(\")\",VLOOKUP(C17,표1[],16,0))-1)=\"1\",Z17*('사원정보(입력)'!V$9/100),Z17*('사원정보(입력)'!V$9/100)*(1-((LEFT(VLOOKUP(C17,표1[],16,0),FIND(\")\",VLOOKUP(C17,표1[],16,0))-1)-2)/10))),option!$G$3*-1)))","v":0},{"$f":"IF(LEN(C17)=0,0,IF(LEFT(VLOOKUP(C17,표1[],17,0),1)=\"2\",0,ROUNDDOWN(SUMIF(option!$C$2:$Q$2,0,G17:U17)*('사원정보(입력)'!V$10/100),option!$H$3*-1)))","v":{"$error":"#N/A"}},"","",null,null,null,null,null,null,null,{"$error":"#N/A"},{"$error":"#N/A"}]
[null,13,{"$f":"'사원정보(입력)'!B19","v":0},{"$f":"IFERROR(VLOOKUP(C18,표1[],2,0),\"\")","v":""},{"$f":"IFERROR(VLOOKUP(C18,표1[],3,0),\"\")","v":""},{"$f":"IFERROR(VLOOKUP(C18,표1[],4,0),\"\")","v":""},{"$f":"IFERROR(VLOOKUP(C18,표1[],11,0),0)","v":0},null,null,null,null,null,null,null,null,null,null,null,null,null,null,0,{"$f":"IF(LEN(C18)=0,0,IFERROR(IF(LEN(VLOOKUP(C18,표1[],18,0))=0,0,ROUNDDOWN(CHOOSE(LEFT(VLOOKUP(C18,표1[],18,0),1),INTAX(SUMIF(option!$C$2:$Q$2,0,G18:U18),VLOOKUP(C18,표1[],9,0),VLOOKUP(C18,표1[],10,0)),INTAX(SUMIF(option!$C$2:$Q$2,0,G18:U18),VLOOKUP(C18,표1[],9,0),VLOOKUP(C18,표1[],10,0))*1.2,INTAX(SUMIF(option!$C$2:$Q$2,0,G18:U18),VLOOKUP(C18,표1[],9,0),VLOOKUP(C18,표1[],10,0))*0.8,V18*(('사원정보(입력)'!V$13/1.1)/100),V18*(('사원정보(입력)'!V$14/1.1)/100)),option!$C$3*-1)),0))","v":0},{"$f":"IF(W18=0,0,ROUNDDOWN(W18*0.1,option!$D$3*-1))","v":0},{"$f":"IF(LEN(C18)=0,0,IFERROR(ROUNDDOWN(ctax(LEFT(VLOOKUP(C18,표1[],14,0),FIND(\")\",VLOOKUP(C18,표1[],14,0))-1),SUMIF(option!$C$2:$Q$2,0,G18:U18),'사원정보(입력)'!V$7,VLOOKUP(C18,표1[],12,0)),option!$E$3*-1),0))","v":0},{"$f":"IF(LEN(C18)=0,0,IFERROR(ROUNDDOWN(HTAX(LEFT(VLOOKUP(C18,표1[],15,0),FIND(\")\",VLOOKUP(C18,표1[],15,0))-1),SUMIF(option!$C$2:$Q$2,0,G18:U18),'사원정보(입력)'!V$8,VLOOKUP(C18,표1[],13,0)),option!$F$3*-1),0))","v":0},{"$f":"IF(Z18=0,0,IF(LEFT(VLOOKUP(C18,표1[],16,0),FIND(\")\",VLOOKUP(C18,표1[],16,0))-1)=\"2\",0,ROUNDDOWN(IF(LEFT(VLOOKUP(C18,표1[],16,0),FIND(\")\",VLOOKUP(C18,표1[],16,0))-1)=\"1\",Z18*('사원정보(입력)'!V$9/100),Z18*('사원정보(입력)'!V$9/100)*(1-((LEFT(VLOOKUP(C18,표1[],16,0),FIND(\")\",VLOOKUP(C18,표1[],16,0))-1)-2)/10))),option!$G$3*-1)))","v":0},{"$f":"IF(LEN(C18)=0,0,IF(LEFT(VLOOKUP(C18,표1[],17,0),1)=\"2\",0,ROUNDDOWN(SUMIF(option!$C$2:$Q$2,0,G18:U18)*('사원정보(입력)'!V$10/100),option!$H$3*-1)))","v":{"$error":"#N/A"}},"","",null,null,null,null,null,null,null,{"$error":"#N/A"},{"$error":"#N/A"}]
[null,14,{"$f":"'사원정보(입력)'!B20","v":0},{"$f":"IFERROR(VLOOKUP(C19,표1[],2,0),\"\")","v":""},{"$f":"IFERROR(VLOOKUP(C19,표1[],3,0),\"\")","v":""},{"$f":"IFERROR(VLOOKUP(C19,표1[],4,0),\"\")","v":""},{"$f":"IFERROR(VLOOKUP(C19,표1[],11,0),0)","v":0},null,null,null,null,null,null,null,null,null,null,null,null,null,null,0,{"$f":"IF(LEN(C19)=0,0,IFERROR(IF(LEN(VLOOKUP(C19,표1[],18,0))=0,0,ROUNDDOWN(CHOOSE(LEFT(VLOOKUP(C19,표1[],18,0),1),INTAX(SUMIF(option!$C$2:$Q$2,0,G19:U19),VLOOKUP(C19,표1[],9,0),VLOOKUP(C19,표1[],10,0)),INTAX(SUMIF(option!$C$2:$Q$2,0,G19:U19),VLOOKUP(C19,표1[],9,0),VLOOKUP(C19,표1[],10,0))*1.2,INTAX(SUMIF(option!$C$2:$Q$2,0,G19:U19),VLOOKUP(C19,표1[],9,0),VLOOKUP(C19,표1[],10,0))*0.8,V19*(('사원정보(입력)'!V$13/1.1)/100),V19*(('사원정보(입력)'!V$14/1.1)/100)),option!$C$3*-1)),0))","v":0},{"$f":"IF(W19=0,0,ROUNDDOWN(W19*0.1,option!$D$3*-1))","v":0},{"$f":"IF(LEN(C19)=0,0,IFERROR(ROUNDDOWN(ctax(LEFT(VLOOKUP(C19,표1[],14,0),FIND(\")\",VLOOKUP(C19,표1[],14,0))-1),SUMIF(option!$C$2:$Q$2,0,G19:U19),'사원정보(입력)'!V$7,VLOOKUP(C19,표1[],12,0)),option!$E$3*-1),0))","v":0},{"$f":"IF(LEN(C19)=0,0,IFERROR(ROUNDDOWN(HTAX(LEFT(VLOOKUP(C19,표1[],15,0),FIND(\")\",VLOOKUP(C19,표1[],15,0))-1),SUMIF(option!$C$2:$Q$2,0,G19:U19),'사원정보(입력)'!V$8,VLOOKUP(C19,표1[],13,0)),option!$F$3*-1),0))","v":0},{"$f":"IF(Z19=0,0,IF(LEFT(VLOOKUP(C19,표1[],16,0),FIND(\")\",VLOOKUP(C19,표1[],16,0))-1)=\"2\",0,ROUNDDOWN(IF(LEFT(VLOOKUP(C19,표1[],16,0),FIND(\")\",VLOOKUP(C19,표1[],16,0))-1)=\"1\",Z19*('사원정보(입력)'!V$9/100),Z19*('사원정보(입력)'!V$9/100)*(1-((LEFT(VLOOKUP(C19,표1[],16,0),FIND(\")\",VLOOKUP(C19,표1[],16,0))-1)-2)/10))),option!$G$3*-1)))","v":0},{"$f":"IF(LEN(C19)=0,0,IF(LEFT(VLOOKUP(C19,표1[],17,0),1)=\"2\",0,ROUNDDOWN(SUMIF(option!$C$2:$Q$2,0,G19:U19)*('사원정보(입력)'!V$10/100),option!$H$3*-1)))","v":{"$error":"#N/A"}},"","",null,null,null,null,null,null,null,{"$error":"#N/A"},{"$error":"#N/A"}]
[null,15,{"$f":"'사원정보(입력)'!B21","v":0},{"$f":"IFERROR(VLOOKUP(C20,표1[],2,0),\"\")","v":""},{"$f":"IFERROR(VLOOKUP(C20,표1[],3,0),\"\")","v":""},{"$f":"IFERROR(VLOOKUP(C20,표1[],4,0),\"\")","v":""},{"$f":"IFERROR(VLOOKUP(C20,표1[],11,0),0)","v":0},null,null,null,null,null,null,null,null,null,null,null,null,null,null,0,{"$f":"IF(LEN(C20)=0,0,IFERROR(IF(LEN(VLOOKUP(C20,표1[],18,0))=0,0,ROUNDDOWN(CHOOSE(LEFT(VLOOKUP(C20,표1[],18,0),1),INTAX(SUMIF(option!$C$2:$Q$2,0,G20:U20),VLOOKUP(C20,표1[],9,0),VLOOKUP(C20,표1[],10,0)),INTAX(SUMIF(option!$C$2:$Q$2,0,G20:U20),VLOOKUP(C20,표1[],9,0),VLOOKUP(C20,표1[],10,0))*1.2,INTAX(SUMIF(option!$C$2:$Q$2,0,G20:U20),VLOOKUP(C20,표1[],9,0),VLOOKUP(C20,표1[],10,0))*0.8,V20*(('사원정보(입력)'!V$13/1.1)/100),V20*(('사원정보(입력)'!V$14/1.1)/100)),option!$C$3*-1)),0))","v":0},{"$f":"IF(W20=0,0,ROUNDDOWN(W20*0.1,option!$D$3*-1))","v":0},{"$f":"IF(LEN(C20)=0,0,IFERROR(ROUNDDOWN(ctax(LEFT(VLOOKUP(C20,표1[],14,0),FIND(\")\",VLOOKUP(C20,표1[],14,0))-1),SUMIF(option!$C$2:$Q$2,0,G20:U20),'사원정보(입력)'!V$7,VLOOKUP(C20,표1[],12,0)),option!$E$3*-1),0))","v":0},{"$f":"IF(LEN(C20)=0,0,IFERROR(ROUNDDOWN(HTAX(LEFT(VLOOKUP(C20,표1[],15,0),FIND(\")\",VLOOKUP(C20,표1[],15,0))-1),SUMIF(option!$C$2:$Q$2,0,G20:U20),'사원정보(입력)'!V$8,VLOOKUP(C20,표1[],13,0)),option!$F$3*-1),0))","v":0},{"$f":"IF(Z20=0,0,IF(LEFT(VLOOKUP(C20,표1[],16,0),FIND(\")\",VLOOKUP(C20,표1[],16,0))-1)=\"2\",0,ROUNDDOWN(IF(LEFT(VLOOKUP(C20,표1[],16,0),FIND(\")\",VLOOKUP(C20,표1[],16,0))-1)=\"1\",Z20*('사원정보(입력)'!V$9/100),Z20*('사원정보(입력)'!V$9/100)*(1-((LEFT(VLOOKUP(C20,표1[],16,0),FIND(\")\",VLOOKUP(C20,표1[],16,0))-1)-2)/10))),option!$G$3*-1)))","v":0},{"$f":"IF(LEN(C20)=0,0,IF(LEFT(VLOOKUP(C20,표1[],17,0),1)=\"2\",0,ROUNDDOWN(SUMIF(option!$C$2:$Q$2,0,G20:U20)*('사원정보(입력)'!V$10/100),option!$H$3*-1)))","v":{"$error":"#N/A"}},"","",null,null,null,null,null,null,null,{"$error":"#N/A"},{"$error":"#N/A"}]
[null,16,{"$f":"'사원정보(입력)'!B22","v":0},{"$f":"IFERROR(VLOOKUP(C21,표1[],2,0),\"\")","v":""},{"$f":"IFERROR(VLOOKUP(C21,표1[],3,0),\"\")","v":""},{"$f":"IFERROR(VLOOKUP(C21,표1[],4,0),\"\")","v":""},{"$f":"IFERROR(VLOOKUP(C21,표1[],11,0),0)","v":0},null,null,null,null,null,null,null,null,null,null,null,null,null,null,0,{"$f":"IF(LEN(C21)=0,0,IFERROR(IF(LEN(VLOOKUP(C21,표1[],18,0))=0,0,ROUNDDOWN(CHOOSE(LEFT(VLOOKUP(C21,표1[],18,0),1),INTAX(SUMIF(option!$C$2:$Q$2,0,G21:U21),VLOOKUP(C21,표1[],9,0),VLOOKUP(C21,표1[],10,0)),INTAX(SUMIF(option!$C$2:$Q$2,0,G21:U21),VLOOKUP(C21,표1[],9,0),VLOOKUP(C21,표1[],10,0))*1.2,INTAX(SUMIF(option!$C$2:$Q$2,0,G21:U21),VLOOKUP(C21,표1[],9,0),VLOOKUP(C21,표1[],10,0))*0.8,V21*(('사원정보(입력)'!V$13/1.1)/100),V21*(('사원정보(입력)'!V$14/1.1)/100)),option!$C$3*-1)),0))","v":0},{"$f":"IF(W21=0,0,ROUNDDOWN(W21*0.1,option!$D$3*-1))","v":0},{"$f":"IF(LEN(C21)=0,0,IFERROR(ROUNDDOWN(ctax(LEFT(VLOOKUP(C21,표1[],14,0),FIND(\")\",VLOOKUP(C21,표1[],14,0))-1),SUMIF(option!$C$2:$Q$2,0,G21:U21),'사원정보(입력)'!V$7,VLOOKUP(C21,표1[],12,0)),option!$E$3*-1),0))","v":0},{"$f":"IF(LEN(C21)=0,0,IFERROR(ROUNDDOWN(HTAX(LEFT(VLOOKUP(C21,표1[],15,0),FIND(\")\",VLOOKUP(C21,표1[],15,0))-1),SUMIF(option!$C$2:$Q$2,0,G21:U21),'사원정보(입력)'!V$8,VLOOKUP(C21,표1[],13,0)),option!$F$3*-1),0))","v":0},{"$f":"IF(Z21=0,0,IF(LEFT(VLOOKUP(C21,표1[],16,0),FIND(\")\",VLOOKUP(C21,표1[],16,0))-1)=\"2\",0,ROUNDDOWN(IF(LEFT(VLOOKUP(C21,표1[],16,0),FIND(\")\",VLOOKUP(C21,표1[],16,0))-1)=\"1\",Z21*('사원정보(입력)'!V$9/100),Z21*('사원정보(입력)'!V$9/100)*(1-((LEFT(VLOOKUP(C21,표1[],16,0),FIND(\")\",VLOOKUP(C21,표1[],16,0))-1)-2)/10))),option!$G$3*-1)))","v":0},{"$f":"IF(LEN(C21)=0,0,IF(LEFT(VLOOKUP(C21,표1[],17,0),1)=\"2\",0,ROUNDDOWN(SUMIF(option!$C$2:$Q$2,0,G21:U21)*('사원정보(입력)'!V$10/100),option!$H$3*-1)))","v":{"$error":"#N/A"}},"","",null,null,null,null,null,null,null,{"$error":"#N/A"},{"$error":"#N/A"}]
[null,17,{"$f":"'사원정보(입력)'!B23","v":0},{"$f":"IFERROR(VLOOKUP(C22,표1[],2,0),\"\")","v":""},{"$f":"IFERROR(VLOOKUP(C22,표1[],3,0),\"\")","v":""},{"$f":"IFERROR(VLOOKUP(C22,표1[],4,0),\"\")","v":""},{"$f":"IFERROR(VLOOKUP(C22,표1[],11,0),0)","v":0},null,null,null,null,null,null,null,null,null,null,null,null,null,null,0,{"$f":"IF(LEN(C22)=0,0,IFERROR(IF(LEN(VLOOKUP(C22,표1[],18,0))=0,0,ROUNDDOWN(CHOOSE(LEFT(VLOOKUP(C22,표1[],18,0),1),INTAX(SUMIF(option!$C$2:$Q$2,0,G22:U22),VLOOKUP(C22,표1[],9,0),VLOOKUP(C22,표1[],10,0)),INTAX(SUMIF(option!$C$2:$Q$2,0,G22:U22),VLOOKUP(C22,표1[],9,0),VLOOKUP(C22,표1[],10,0))*1.2,INTAX(SUMIF(option!$C$2:$Q$2,0,G22:U22),VLOOKUP(C22,표1[],9,0),VLOOKUP(C22,표1[],10,0))*0.8,V22*(('사원정보(입력)'!V$13/1.1)/100),V22*(('사원정보(입력)'!V$14/1.1)/100)),option!$C$3*-1)),0))","v":0},{"$f":"IF(W22=0,0,ROUNDDOWN(W22*0.1,option!$D$3*-1))","v":0},{"$f":"IF(LEN(C22)=0,0,IFERROR(ROUNDDOWN(ctax(LEFT(VLOOKUP(C22,표1[],14,0),FIND(\")\",VLOOKUP(C22,표1[],14,0))-1),SUMIF(option!$C$2:$Q$2,0,G22:U22),'사원정보(입력)'!V$7,VLOOKUP(C22,표1[],12,0)),option!$E$3*-1),0))","v":0},{"$f":"IF(LEN(C22)=0,0,IFERROR(ROUNDDOWN(HTAX(LEFT(VLOOKUP(C22,표1[],15,0),FIND(\")\",VLOOKUP(C22,표1[],15,0))-1),SUMIF(option!$C$2:$Q$2,0,G22:U22),'사원정보(입력)'!V$8,VLOOKUP(C22,표1[],13,0)),option!$F$3*-1),0))","v":0},{"$f":"IF(Z22=0,0,IF(LEFT(VLOOKUP(C22,표1[],16,0),FIND(\")\",VLOOKUP(C22,표1[],16,0))-1)=\"2\",0,ROUNDDOWN(IF(LEFT(VLOOKUP(C22,표1[],16,0),FIND(\")\",VLOOKUP(C22,표1[],16,0))-1)=\"1\",Z22*('사원정보(입력)'!V$9/100),Z22*('사원정보(입력)'!V$9/100)*(1-((LEFT(VLOOKUP(C22,표1[],16,0),FIND(\")\",VLOOKUP(C22,표1[],16,0))-1)-2)/10))),option!$G$3*-1)))","v":0},{"$f":"IF(LEN(C22)=0,0,IF(LEFT(VLOOKUP(C22,표1[],17,0),1)=\"2\",0,ROUNDDOWN(SUMIF(option!$C$2:$Q$2,0,G22:U22)*('사원정보(입력)'!V$10/100),option!$H$3*-1)))","v":{"$error":"#N/A"}},"","",null,null,null,null,null,null,null,{"$error":"#N/A"},{"$error":"#N/A"}]
[null,18,{"$f":"'사원정보(입력)'!B24","v":0},{"$f":"IFERROR(VLOOKUP(C23,표1[],2,0),\"\")","v":""},{"$f":"IFERROR(VLOOKUP(C23,표1[],3,0),\"\")","v":""},{"$f":"IFERROR(VLOOKUP(C23,표1[],4,0),\"\")","v":""},{"$f":"IFERROR(VLOOKUP(C23,표1[],11,0),0)","v":0},null,null,null,null,null,null,null,null,null,null,null,null,null,null,0,{"$f":"IF(LEN(C23)=0,0,IFERROR(IF(LEN(VLOOKUP(C23,표1[],18,0))=0,0,ROUNDDOWN(CHOOSE(LEFT(VLOOKUP(C23,표1[],18,0),1),INTAX(SUMIF(option!$C$2:$Q$2,0,G23:U23),VLOOKUP(C23,표1[],9,0),VLOOKUP(C23,표1[],10,0)),INTAX(SUMIF(option!$C$2:$Q$2,0,G23:U23),VLOOKUP(C23,표1[],9,0),VLOOKUP(C23,표1[],10,0))*1.2,INTAX(SUMIF(option!$C$2:$Q$2,0,G23:U23),VLOOKUP(C23,표1[],9,0),VLOOKUP(C23,표1[],10,0))*0.8,V23*(('사원정보(입력)'!V$13/1.1)/100),V23*(('사원정보(입력)'!V$14/1.1)/100)),option!$C$3*-1)),0))","v":0},{"$f":"IF(W23=0,0,ROUNDDOWN(W23*0.1,option!$D$3*-1))","v":0},{"$f":"IF(LEN(C23)=0,0,IFERROR(ROUNDDOWN(ctax(LEFT(VLOOKUP(C23,표1[],14,0),FIND(\")\",VLOOKUP(C23,표1[],14,0))-1),SUMIF(option!$C$2:$Q$2,0,G23:U23),'사원정보(입력)'!V$7,VLOOKUP(C23,표1[],12,0)),option!$E$3*-1),0))","v":0},{"$f":"IF(LEN(C23)=0,0,IFERROR(ROUNDDOWN(HTAX(LEFT(VLOOKUP(C23,표1[],15,0),FIND(\")\",VLOOKUP(C23,표1[],15,0))-1),SUMIF(option!$C$2:$Q$2,0,G23:U23),'사원정보(입력)'!V$8,VLOOKUP(C23,표1[],13,0)),option!$F$3*-1),0))","v":0},{"$f":"IF(Z23=0,0,IF(LEFT(VLOOKUP(C23,표1[],16,0),FIND(\")\",VLOOKUP(C23,표1[],16,0))-1)=\"2\",0,ROUNDDOWN(IF(LEFT(VLOOKUP(C23,표1[],16,0),FIND(\")\",VLOOKUP(C23,표1[],16,0))-1)=\"1\",Z23*('사원정보(입력)'!V$9/100),Z23*('사원정보(입력)'!V$9/100)*(1-((LEFT(VLOOKUP(C23,표1[],16,0),FIND(\")\",VLOOKUP(C23,표1[],16,0))-1)-2)/10))),option!$G$3*-1)))","v":0},{"$f":"IF(LEN(C23)=0,0,IF(LEFT(VLOOKUP(C23,표1[],17,0),1)=\"2\",0,ROUNDDOWN(SUMIF(option!$C$2:$Q$2,0,G23:U23)*('사원정보(입력)'!V$10/100),option!$H$3*-1)))","v":{"$error":"#N/A"}},"","",null,null,null,null,null,null,null,{"$error":"#N/A"},{"$error":"#N/A"}]
[null,19,{"$f":"'사원정보(입력)'!B25","v":0},{"$f":"IFERROR(VLOOKUP(C24,표1[],2,0),\"\")","v":""},{"$f":"IFERROR(VLOOKUP(C24,표1[],3,0),\"\")","v":""},{"$f":"IFERROR(VLOOKUP(C24,표1[],4,0),\"\")","v":""},{"$f":"IFERROR(VLOOKUP(C24,표1[],11,0),0)","v":0},null,null,null,null,null,null,null,null,null,null,null,null,null,null,{"$f":"SUM(G24:U24)","v":0},{"$f":"IF(LEN(C24)=0,0,IFERROR(IF(LEN(VLOOKUP(C24,표1[],18,0))=0,0,ROUNDDOWN(CHOOSE(LEFT(VLOOKUP(C24,표1[],18,0),1),INTAX(SUMIF(option!$C$2:$Q$2,0,G24:U24),VLOOKUP(C24,표1[],9,0),VLOOKUP(C24,표1[],10,0)),INTAX(SUMIF(option!$C$2:$Q$2,0,G24:U24),VLOOKUP(C24,표1[],9,0),VLOOKUP(C24,표1[],10,0))*1.2,INTAX(SUMIF(option!$C$2:$Q$2,0,G24:U24),VLOOKUP(C24,표1[],9,0),VLOOKUP(C24,표1[],10,0))*0.8,V24*(('사원정보(입력)'!V$13/1.1)/100),V24*(('사원정보(입력)'!V$14/1.1)/100)),option!$C$3*-1)),0))","v":0},{"$f":"IF(W24=0,0,ROUNDDOWN(W24*0.1,option!$D$3*-1))","v":0},{"$f":"IF(LEN(C24)=0,0,IFERROR(ROUNDDOWN(ctax(LEFT(VLOOKUP(C24,표1[],14,0),FIND(\")\",VLOOKUP(C24,표1[],14,0))-1),SUMIF(option!$C$2:$Q$2,0,G24:U24),'사원정보(입력)'!V$7,VLOOKUP(C24,표1[],12,0)),option!$E$3*-1),0))","v":0},{"$f":"IF(LEN(C24)=0,0,IFERROR(ROUNDDOWN(HTAX(LEFT(VLOOKUP(C24,표1[],15,0),FIND(\")\",VLOOKUP(C24,표1[],15,0))-1),SUMIF(option!$C$2:$Q$2,0,G24:U24),'사원정보(입력)'!V$8,VLOOKUP(C24,표1[],13,0)),option!$F$3*-1),0))","v":0},{"$f":"IF(Z24=0,0,IF(LEFT(VLOOKUP(C24,표1[],16,0),FIND(\")\",VLOOKUP(C24,표1[],16,0))-1)=\"2\",0,ROUNDDOWN(IF(LEFT(VLOOKUP(C24,표1[],16,0),FIND(\")\",VLOOKUP(C24,표1[],16,0))-1)=\"1\",Z24*('사원정보(입력)'!V$9/100),Z24*('사원정보(입력)'!V$9/100)*(1-((LEFT(VLOOKUP(C24,표1[],16,0),FIND(\")\",VLOOKUP(C24,표1[],16,0))-1)-2)/10))),option!$G$3*-1)))","v":0},{"$f":"IF(LEN(C24)=0,0,IF(LEFT(VLOOKUP(C24,표1[],17,0),1)=\"2\",0,ROUNDDOWN(SUMIF(option!$C$2:$Q$2,0,G24:U24)*('사원정보(입력)'!V$10/100),option!$H$3*-1)))","v":{"$error":"#N/A"}},{"$f":"IF(E24=\"지입\",((V24/1.1)*79.8%)*0.7%,\"\")","v":""},{"$f":"IF(E24=\"지입\",11495,\"\")","v":""},null,null,null,null,null,null,null,{"$f":"SUM(W24:AK24)","v":{"$error":"#N/A"}},{"$error":"#N/A"}]
[null,20,{"$f":"'사원정보(입력)'!B26","v":0},{"$f":"IFERROR(VLOOKUP(C25,표1[],2,0),\"\")","v":""},{"$f":"IFERROR(VLOOKUP(C25,표1[],3,0),\"\")","v":""},{"$f":"IFERROR(VLOOKUP(C25,표1[],4,0),\"\")","v":""},{"$f":"IFERROR(VLOOKUP(C25,표1[],11,0),0)","v":0},null,null,null,null,null,null,null,null,null,null,null,null,null,null,0,{"$f":"IF(LEN(C25)=0,0,IFERROR(IF(LEN(VLOOKUP(C25,표1[],18,0))=0,0,ROUNDDOWN(CHOOSE(LEFT(VLOOKUP(C25,표1[],18,0),1),INTAX(SUMIF(option!$C$2:$Q$2,0,G25:U25),VLOOKUP(C25,표1[],9,0),VLOOKUP(C25,표1[],10,0)),INTAX(SUMIF(option!$C$2:$Q$2,0,G25:U25),VLOOKUP(C25,표1[],9,0),VLOOKUP(C25,표1[],10,0))*1.2,INTAX(SUMIF(option!$C$2:$Q$2,0,G25:U25),VLOOKUP(C25,표1[],9,0),VLOOKUP(C25,표1[],10,0))*0.8,V25*(('사원정보(입력)'!V$13/1.1)/100),V25*(('사원정보(입력)'!V$14/1.1)/100)),option!$C$3*-1)),0))","v":0},{"$f":"IF(W25=0,0,ROUNDDOWN(W25*0.1,option!$D$3*-1))","v":0},{"$f":"IF(LEN(C25)=0,0,IFERROR(ROUNDDOWN(ctax(LEFT(VLOOKUP(C25,표1[],14,0),FIND(\")\",VLOOKUP(C25,표1[],14,0))-1),SUMIF(option!$C$2:$Q$2,0,G25:U25),'사원정보(입력)'!V$7,VLOOKUP(C25,표1[],12,0)),option!$E$3*-1),0))","v":0},{"$f":"IF(LEN(C25)=0,0,IFERROR(ROUNDDOWN(HTAX(LEFT(VLOOKUP(C25,표1[],15,0),FIND(\")\",VLOOKUP(C25,표1[],15,0))-1),SUMIF(option!$C$2:$Q$2,0,G25:U25),'사원정보(입력)'!V$8,VLOOKUP(C25,표1[],13,0)),option!$F$3*-1),0))","v":0},{"$f":"IF(Z25=0,0,IF(LEFT(VLOOKUP(C25,표1[],16,0),FIND(\")\",VLOOKUP(C25,표1[],16,0))-1)=\"2\",0,ROUNDDOWN(IF(LEFT(VLOOKUP(C25,표1[],16,0),FIND(\")\",VLOOKUP(C25,표1[],16,0))-1)=\"1\",Z25*('사원정보(입력)'!V$9/100),Z25*('사원정보(입력)'!V$9/100)*(1-((LEFT(VLOOKUP(C25,표1[],16,0),FIND(\")\",VLOOKUP(C25,표1[],16,0))-1)-2)/10))),option!$G$3*-1)))","v":0},{"$f":"IF(LEN(C25)=0,0,IF(LEFT(VLOOKUP(C25,표1[],17,0),1)=\"2\",0,ROUNDDOWN(SUMIF(option!$C$2:$Q$2,0,G25:U25)*('사원정보(입력)'!V$10/100),option!$H$3*-1)))","v":{"$error":"#N/A"}},"","",null,null,null,null,null,null,null,{"$error":"#N/A"},{"$error":"#N/A"}]
[null,21,{"$f":"'사원정보(입력)'!B27","v":0},{"$f":"IFERROR(VLOOKUP(C26,표1[],2,0),\"\")","v":""},{"$f":"IFERROR(VLOOKUP(C26,표1[],3,0),\"\")","v":""},{"$f":"IFERROR(VLOOKUP(C26,표1[],4,0),\"\")","v":""},{"$f":"IFERROR(VLOOKUP(C26,표1[],11,0),0)","v":0},null,null,null,null,null,null,null,null,null,null,null,null,null,null,{"$f":"SUM(G26:U26)","v":0},{"$f":"IF(LEN(C26)=0,0,IFERROR(IF(LEN(VLOOKUP(C26,표1[],18,0))=0,0,ROUNDDOWN(CHOOSE(LEFT(VLOOKUP(C26,표1[],18,0),1),INTAX(SUMIF(option!$C$2:$Q$2,0,G26:U26),VLOOKUP(C26,표1[],9,0),VLOOKUP(C26,표1[],10,0)),INTAX(SUMIF(option!$C$2:$Q$2,0,G26:U26),VLOOKUP(C26,표1[],9,0),VLOOKUP(C26,표1[],10,0))*1.2,INTAX(SUMIF(option!$C$2:$Q$2,0,G26:U26),VLOOKUP(C26,표1[],9,0),VLOOKUP(C26,표1[],10,0))*0.8,V26*(('사원정보(입력)'!V$13/1.1)/100),V26*(('사원정보(입력)'!V$14/1.1)/100)),option!$C$3*-1)),0))","v":0},{"$f":"IF(W26=0,0,ROUNDDOWN(W26*0.1,option!$D$3*-1))","v":0},{"$f":"IF(LEN(C26)=0,0,IFERROR(ROUNDDOWN(ctax(LEFT(VLOOKUP(C26,표1[],14,0),FIND(\")\",VLOOKUP(C26,표1[],14,0))-1),SUMIF(option!$C$2:$Q$2,0,G26:U26),'사원정보(입력)'!V$7,VLOOKUP(C26,표1[],12,0)),option!$E$3*-1),0))","v":0},{"$f":"IF(LEN(C26)=0,0,IFERROR(ROUNDDOWN(HTAX(LEFT(VLOOKUP(C26,표1[],15,0),FIND(\")\",VLOOKUP(C26,표1[],15,0))-1),SUMIF(option!$C$2:$Q$2,0,G26:U26),'사원정보(입력)'!V$8,VLOOKUP(C26,표1[],13,0)),option!$F$3*-1),0))","v":0},{"$f":"IF(Z26=0,0,IF(LEFT(VLOOKUP(C26,표1[],16,0),FIND(\")\",VLOOKUP(C26,표1[],16,0))-1)=\"2\",0,ROUNDDOWN(IF(LEFT(VLOOKUP(C26,표1[],16,0),FIND(\")\",VLOOKUP(C26,표1[],16,0))-1)=\"1\",Z26*('사원정보(입력)'!V$9/100),Z26*('사원정보(입력)'!V$9/100)*(1-((LEFT(VLOOKUP(C26,표1[],16,0),FIND(\")\",VLOOKUP(C26,표1[],16,0))-1)-2)/10))),option!$G$3*-1)))","v":0},{"$f":"IF(LEN(C26)=0,0,IF(LEFT(VLOOKUP(C26,표1[],17,0),1)=\"2\",0,ROUNDDOWN(SUMIF(option!$C$2:$Q$2,0,G26:U26)*('사원정보(입력)'!V$10/100),option!$H$3*-1)))","v":{"$error":"#N/A"}},"","",null,null,null,null,null,null,null,{"$f":"SUM(W26:AK26)","v":{"$error":"#N/A"}},{"$f":"V26-AL26","v":{"$error":"#N/A"}}]
[null,22,{"$f":"'사원정보(입력)'!B28","v":0},{"$f":"IFERROR(VLOOKUP(C27,표1[],2,0),\"\")","v":""},{"$f":"IFERROR(VLOOKUP(C27,표1[],3,0),\"\")","v":""},{"$f":"IFERROR(VLOOKUP(C27,표1[],4,0),\"\")","v":""},{"$f":"IFERROR(VLOOKUP(C27,표1[],11,0),0)","v":0},null,null,null,null,null,null,null,null,null,null,null,null,null,null,{"$f":"SUM(G27:U27)","v":0},{"$f":"IF(LEN(C27)=0,0,IFERROR(IF(LEN(VLOOKUP(C27,표1[],18,0))=0,0,ROUNDDOWN(CHOOSE(LEFT(VLOOKUP(C27,표1[],18,0),1),INTAX(SUMIF(option!$C$2:$Q$2,0,G27:U27),VLOOKUP(C27,표1[],9,0),VLOOKUP(C27,표1[],10,0)),INTAX(SUMIF(option!$C$2:$Q$2,0,G27:U27),VLOOKUP(C27,표1[],9,0),VLOOKUP(C27,표1[],10,0))*1.2,INTAX(SUMIF(option!$C$2:$Q$2,0,G27:U27),VLOOKUP(C27,표1[],9,0),VLOOKUP(C27,표1[],10,0))*0.8,V27*(('사원정보(입력)'!V$13/1.1)/100),V27*(('사원정보(입력)'!V$14/1.1)/100)),option!$C$3*-1)),0))","v":0},{"$f":"IF(W27=0,0,ROUNDDOWN(W27*0.1,option!$D$3*-1))","v":0},{"$f":"IF(LEN(C27)=0,0,IFERROR(ROUNDDOWN(ctax(LEFT(VLOOKUP(C27,표1[],14,0),FIND(\")\",VLOOKUP(C27,표1[],14,0))-1),SUMIF(option!$C$2:$Q$2,0,G27:U27),'사원정보(입력)'!V$7,VLOOKUP(C27,표1[],12,0)),option!$E$3*-1),0))","v":0},{"$f":"IF(LEN(C27)=0,0,IFERROR(ROUNDDOWN(HTAX(LEFT(VLOOKUP(C27,표1[],15,0),FIND(\")\",VLOOKUP(C27,표1[],15,0))-1),SUMIF(option!$C$2:$Q$2,0,G27:U27),'사원정보(입력)'!V$8,VLOOKUP(C27,표1[],13,0)),option!$F$3*-1),0))","v":0},{"$f":"IF(Z27=0,0,IF(LEFT(VLOOKUP(C27,표1[],16,0),FIND(\")\",VLOOKUP(C27,표1[],16,0))-1)=\"2\",0,ROUNDDOWN(IF(LEFT(VLOOKUP(C27,표1[],16,0),FIND(\")\",VLOOKUP(C27,표1[],16,0))-1)=\"1\",Z27*('사원정보(입력)'!V$9/100),Z27*('사원정보(입력)'!V$9/100)*(1-((LEFT(VLOOKUP(C27,표1[],16,0),FIND(\")\",VLOOKUP(C27,표1[],16,0))-1)-2)/10))),option!$G$3*-1)))","v":0},{"$f":"IF(LEN(C27)=0,0,IF(LEFT(VLOOKUP(C27,표1[],17,0),1)=\"2\",0,ROUNDDOWN(SUMIF(option!$C$2:$Q$2,0,G27:U27)*('사원정보(입력)'!V$10/100),option!$H$3*-1)))","v":{"$error":"#N/A"}},"","",null,null,null,null,null,null,null,{"$f":"SUM(W27:AK27)","v":{"$error":"#N/A"}},{"$f":"V27-AL27","v":{"$error":"#N/A"}}]
[null,23,{"$f":"'사원정보(입력)'!B29","v":0},{"$f":"IFERROR(VLOOKUP(C28,표1[],2,0),\"\")","v":""},{"$f":"IFERROR(VLOOKUP(C28,표1[],3,0),\"\")","v":""},{"$f":"IFERROR(VLOOKUP(C28,표1[],4,0),\"\")","v":""},{"$f":"IFERROR(VLOOKUP(C28,표1[],11,0),0)","v":0},null,null,null,null,null,null,null,null,null,null,null,null,null,null,0,{"$f":"IF(LEN(C28)=0,0,IFERROR(IF(LEN(VLOOKUP(C28,표1[],18,0))=0,0,ROUNDDOWN(CHOOSE(LEFT(VLOOKUP(C28,표1[],18,0),1),INTAX(SUMIF(option!$C$2:$Q$2,0,G28:U28),VLOOKUP(C28,표1[],9,0),VLOOKUP(C28,표1[],10,0)),INTAX(SUMIF(option!$C$2:$Q$2,0,G28:U28),VLOOKUP(C28,표1[],9,0),VLOOKUP(C28,표1[],10,0))*1.2,INTAX(SUMIF(option!$C$2:$Q$2,0,G28:U28),VLOOKUP(C28,표1[],9,0),VLOOKUP(C28,표1[],10,0))*0.8,V28*(('사원정보(입력)'!V$13/1.1)/100),V28*(('사원정보(입력)'!V$14/1.1)/100)),option!$C$3*-1)),0))","v":0},{"$f":"IF(W28=0,0,ROUNDDOWN(W28*0.1,option!$D$3*-1))","v":0},{"$f":"IF(LEN(C28)=0,0,IFERROR(ROUNDDOWN(ctax(LEFT(VLOOKUP(C28,표1[],14,0),FIND(\")\",VLOOKUP(C28,표1[],14,0))-1),SUMIF(option!$C$2:$Q$2,0,G28:U28),'사원정보(입력)'!V$7,VLOOKUP(C28,표1[],12,0)),option!$E$3*-1),0))","v":0},{"$f":"IF(LEN(C28)=0,0,IFERROR(ROUNDDOWN(HTAX(LEFT(VLOOKUP(C28,표1[],15,0),FIND(\")\",VLOOKUP(C28,표1[],15,0))-1),SUMIF(option!$C$2:$Q$2,0,G28:U28),'사원정보(입력)'!V$8,VLOOKUP(C28,표1[],13,0)),option!$F$3*-1),0))","v":0},{"$f":"IF(Z28=0,0,IF(LEFT(VLOOKUP(C28,표1[],16,0),FIND(\")\",VLOOKUP(C28,표1[],16,0))-1)=\"2\",0,ROUNDDOWN(IF(LEFT(VLOOKUP(C28,표1[],16,0),FIND(\")\",VLOOKUP(C28,표1[],16,0))-1)=\"1\",Z28*('사원정보(입력)'!V$9/100),Z28*('사원정보(입력)'!V$9/100)*(1-((LEFT(VLOOKUP(C28,표1[],16,0),FIND(\")\",VLOOKUP(C28,표1[],16,0))-1)-2)/10))),option!$G$3*-1)))","v":0},{"$f":"IF(LEN(C28)=0,0,IF(LEFT(VLOOKUP(C28,표1[],17,0),1)=\"2\",0,ROUNDDOWN(SUMIF(option!$C$2:$Q$2,0,G28:U28)*('사원정보(입력)'!V$10/100),option!$H$3*-1)))","v":{"$error":"#N/A"}},"","",null,null,null,null,null,null,null,{"$error":"#N/A"},{"$error":"#N/A"}]
[null,24,{"$f":"'사원정보(입력)'!B30","v":0},{"$f":"IFERROR(VLOOKUP(C29,표1[],2,0),\"\")","v":""},{"$f":"IFERROR(VLOOKUP(C29,표1[],3,0),\"\")","v":""},{"$f":"IFERROR(VLOOKUP(C29,표1[],4,0),\"\")","v":""},{"$f":"IFERROR(VLOOKUP(C29,표1[],11,0),0)","v":0},null,null,null,null,null,null,null,null,null,null,null,null,null,null,0,{"$f":"IF(LEN(C29)=0,0,IFERROR(IF(LEN(VLOOKUP(C29,표1[],18,0))=0,0,ROUNDDOWN(CHOOSE(LEFT(VLOOKUP(C29,표1[],18,0),1),INTAX(SUMIF(option!$C$2:$Q$2,0,G29:U29),VLOOKUP(C29,표1[],9,0),VLOOKUP(C29,표1[],10,0)),INTAX(SUMIF(option!$C$2:$Q$2,0,G29:U29),VLOOKUP(C29,표1[],9,0),VLOOKUP(C29,표1[],10,0))*1.2,INTAX(SUMIF(option!$C$2:$Q$2,0,G29:U29),VLOOKUP(C29,표1[],9,0),VLOOKUP(C29,표1[],10,0))*0.8,V29*(('사원정보(입력)'!V$13/1.1)/100),V29*(('사원정보(입력)'!V$14/1.1)/100)),option!$C$3*-1)),0))","v":0},{"$f":"IF(W29=0,0,ROUNDDOWN(W29*0.1,option!$D$3*-1))","v":0},{"$f":"IF(LEN(C29)=0,0,IFERROR(ROUNDDOWN(ctax(LEFT(VLOOKUP(C29,표1[],14,0),FIND(\")\",VLOOKUP(C29,표1[],14,0))-1),SUMIF(option!$C$2:$Q$2,0,G29:U29),'사원정보(입력)'!V$7,VLOOKUP(C29,표1[],12,0)),option!$E$3*-1),0))","v":0},{"$f":"IF(LEN(C29)=0,0,IFERROR(ROUNDDOWN(HTAX(LEFT(VLOOKUP(C29,표1[],15,0),FIND(\")\",VLOOKUP(C29,표1[],15,0))-1),SUMIF(option!$C$2:$Q$2,0,G29:U29),'사원정보(입력)'!V$8,VLOOKUP(C29,표1[],13,0)),option!$F$3*-1),0))","v":0},{"$f":"IF(Z29=0,0,IF(LEFT(VLOOKUP(C29,표1[],16,0),FIND(\")\",VLOOKUP(C29,표1[],16,0))-1)=\"2\",0,ROUNDDOWN(IF(LEFT(VLOOKUP(C29,표1[],16,0),FIND(\")\",VLOOKUP(C29,표1[],16,0))-1)=\"1\",Z29*('사원정보(입력)'!V$9/100),Z29*('사원정보(입력)'!V$9/100)*(1-((LEFT(VLOOKUP(C29,표1[],16,0),FIND(\")\",VLOOKUP(C29,표1[],16,0))-1)-2)/10))),option!$G$3*-1)))","v":0},{"$f":"IF(LEN(C29)=0,0,IF(LEFT(VLOOKUP(C29,표1[],17,0),1)=\"2\",0,ROUNDDOWN(SUMIF(option!$C$2:$Q$2,0,G29:U29)*('사원정보(입력)'!V$10/100),option!$H$3*-1)))","v":{"$error":"#N/A"}},"","",null,null,null,null,null,null,null,{"$error":"#N/A"},{"$error":"#N/A"}]
[null,25,{"$f":"'사원정보(입력)'!B31","v":0},{"$f":"IFERROR(VLOOKUP(C30,표1[],2,0),\"\")","v":""},{"$f":"IFERROR(VLOOKUP(C30,표1[],3,0),\"\")","v":""},{"$f":"IFERROR(VLOOKUP(C30,표1[],4,0),\"\")","v":""},{"$f":"IFERROR(VLOOKUP(C30,표1[],11,0),0)","v":0},null,null,null,null,null,null,null,null,null,null,null,null,null,null,0,{"$f":"IF(LEN(C30)=0,0,IFERROR(IF(LEN(VLOOKUP(C30,표1[],18,0))=0,0,ROUNDDOWN(CHOOSE(LEFT(VLOOKUP(C30,표1[],18,0),1),INTAX(SUMIF(option!$C$2:$Q$2,0,G30:U30),VLOOKUP(C30,표1[],9,0),VLOOKUP(C30,표1[],10,0)),INTAX(SUMIF(option!$C$2:$Q$2,0,G30:U30),VLOOKUP(C30,표1[],9,0),VLOOKUP(C30,표1[],10,0))*1.2,INTAX(SUMIF(option!$C$2:$Q$2,0,G30:U30),VLOOKUP(C30,표1[],9,0),VLOOKUP(C30,표1[],10,0))*0.8,V30*(('사원정보(입력)'!V$13/1.1)/100),V30*(('사원정보(입력)'!V$14/1.1)/100)),option!$C$3*-1)),0))","v":0},{"$f":"IF(W30=0,0,ROUNDDOWN(W30*0.1,option!$D$3*-1))","v":0},{"$f":"IF(LEN(C30)=0,0,IFERROR(ROUNDDOWN(ctax(LEFT(VLOOKUP(C30,표1[],14,0),FIND(\")\",VLOOKUP(C30,표1[],14,0))-1),SUMIF(option!$C$2:$Q$2,0,G30:U30),'사원정보(입력)'!V$7,VLOOKUP(C30,표1[],12,0)),option!$E$3*-1),0))","v":0},{"$f":"IF(LEN(C30)=0,0,IFERROR(ROUNDDOWN(HTAX(LEFT(VLOOKUP(C30,표1[],15,0),FIND(\")\",VLOOKUP(C30,표1[],15,0))-1),SUMIF(option!$C$2:$Q$2,0,G30:U30),'사원정보(입력)'!V$8,VLOOKUP(C30,표1[],13,0)),option!$F$3*-1),0))","v":0},{"$f":"IF(Z30=0,0,IF(LEFT(VLOOKUP(C30,표1[],16,0),FIND(\")\",VLOOKUP(C30,표1[],16,0))-1)=\"2\",0,ROUNDDOWN(IF(LEFT(VLOOKUP(C30,표1[],16,0),FIND(\")\",VLOOKUP(C30,표1[],16,0))-1)=\"1\",Z30*('사원정보(입력)'!V$9/100),Z30*('사원정보(입력)'!V$9/100)*(1-((LEFT(VLOOKUP(C30,표1[],16,0),FIND(\")\",VLOOKUP(C30,표1[],16,0))-1)-2)/10))),option!$G$3*-1)))","v":0},{"$f":"IF(LEN(C30)=0,0,IF(LEFT(VLOOKUP(C30,표1[],17,0),1)=\"2\",0,ROUNDDOWN(SUMIF(option!$C$2:$Q$2,0,G30:U30)*('사원정보(입력)'!V$10/100),option!$H$3*-1)))","v":{"$error":"#N/A"}},"","",null,null,null,null,null,null,null,{"$error":"#N/A"},{"$error":"#N/A"}]
[null,26,{"$f":"'사원정보(입력)'!B32","v":0},{"$f":"IFERROR(VLOOKUP(C31,표1[],2,0),\"\")","v":""},{"$f":"IFERROR(VLOOKUP(C31,표1[],3,0),\"\")","v":""},{"$f":"IFERROR(VLOOKUP(C31,표1[],4,0),\"\")","v":""},{"$f":"IFERROR(VLOOKUP(C31,표1[],11,0),0)","v":0},null,null,null,null,null,null,null,null,null,null,null,null,null,null,0,{"$f":"IF(LEN(C31)=0,0,IFERROR(IF(LEN(VLOOKUP(C31,표1[],18,0))=0,0,ROUNDDOWN(CHOOSE(LEFT(VLOOKUP(C31,표1[],18,0),1),INTAX(SUMIF(option!$C$2:$Q$2,0,G31:U31),VLOOKUP(C31,표1[],9,0),VLOOKUP(C31,표1[],10,0)),INTAX(SUMIF(option!$C$2:$Q$2,0,G31:U31),VLOOKUP(C31,표1[],9,0),VLOOKUP(C31,표1[],10,0))*1.2,INTAX(SUMIF(option!$C$2:$Q$2,0,G31:U31),VLOOKUP(C31,표1[],9,0),VLOOKUP(C31,표1[],10,0))*0.8,V31*(('사원정보(입력)'!V$13/1.1)/100),V31*(('사원정보(입력)'!V$14/1.1)/100)),option!$C$3*-1)),0))","v":0},{"$f":"IF(W31=0,0,ROUNDDOWN(W31*0.1,option!$D$3*-1))","v":0},{"$f":"IF(LEN(C31)=0,0,IFERROR(ROUNDDOWN(ctax(LEFT(VLOOKUP(C31,표1[],14,0),FIND(\")\",VLOOKUP(C31,표1[],14,0))-1),SUMIF(option!$C$2:$Q$2,0,G31:U31),'사원정보(입력)'!V$7,VLOOKUP(C31,표1[],12,0)),option!$E$3*-1),0))","v":0},{"$f":"IF(LEN(C31)=0,0,IFERROR(ROUNDDOWN(HTAX(LEFT(VLOOKUP(C31,표1[],15,0),FIND(\")\",VLOOKUP(C31,표1[],15,0))-1),SUMIF(option!$C$2:$Q$2,0,G31:U31),'사원정보(입력)'!V$8,VLOOKUP(C31,표1[],13,0)),option!$F$3*-1),0))","v":0},{"$f":"IF(Z31=0,0,IF(LEFT(VLOOKUP(C31,표1[],16,0),FIND(\")\",VLOOKUP(C31,표1[],16,0))-1)=\"2\",0,ROUNDDOWN(IF(LEFT(VLOOKUP(C31,표1[],16,0),FIND(\")\",VLOOKUP(C31,표1[],16,0))-1)=\"1\",Z31*('사원정보(입력)'!V$9/100),Z31*('사원정보(입력)'!V$9/100)*(1-((LEFT(VLOOKUP(C31,표1[],16,0),FIND(\")\",VLOOKUP(C31,표1[],16,0))-1)-2)/10))),option!$G$3*-1)))","v":0},{"$f":"IF(LEN(C31)=0,0,IF(LEFT(VLOOKUP(C31,표1[],17,0),1)=\"2\",0,ROUNDDOWN(SUMIF(option!$C$2:$Q$2,0,G31:U31)*('사원정보(입력)'!V$10/100),option!$H$3*-1)))","v":{"$error":"#N/A"}},"","",null,null,null,null,null,null,null,{"$error":"#N/A"},{"$error":"#N/A"}]
[null,27,{"$f":"'사원정보(입력)'!B33","v":0},{"$f":"IFERROR(VLOOKUP(C32,표1[],2,0),\"\")","v":""},{"$f":"IFERROR(VLOOKUP(C32,표1[],3,0),\"\")","v":""},{"$f":"IFERROR(VLOOKUP(C32,표1[],4,0),\"\")","v":""},{"$f":"IFERROR(VLOOKUP(C32,표1[],11,0),0)","v":0},null,null,null,null,null,null,null,null,null,null,null,null,null,null,0,{"$f":"IF(LEN(C32)=0,0,IFERROR(IF(LEN(VLOOKUP(C32,표1[],18,0))=0,0,ROUNDDOWN(CHOOSE(LEFT(VLOOKUP(C32,표1[],18,0),1),INTAX(SUMIF(option!$C$2:$Q$2,0,G32:U32),VLOOKUP(C32,표1[],9,0),VLOOKUP(C32,표1[],10,0)),INTAX(SUMIF(option!$C$2:$Q$2,0,G32:U32),VLOOKUP(C32,표1[],9,0),VLOOKUP(C32,표1[],10,0))*1.2,INTAX(SUMIF(option!$C$2:$Q$2,0,G32:U32),VLOOKUP(C32,표1[],9,0),VLOOKUP(C32,표1[],10,0))*0.8,V32*(('사원정보(입력)'!V$13/1.1)/100),V32*(('사원정보(입력)'!V$14/1.1)/100)),option!$C$3*-1)),0))","v":0},{"$f":"IF(W32=0,0,ROUNDDOWN(W32*0.1,option!$D$3*-1))","v":0},{"$f":"IF(LEN(C32)=0,0,IFERROR(ROUNDDOWN(ctax(LEFT(VLOOKUP(C32,표1[],14,0),FIND(\")\",VLOOKUP(C32,표1[],14,0))-1),SUMIF(option!$C$2:$Q$2,0,G32:U32),'사원정보(입력)'!V$7,VLOOKUP(C32,표1[],12,0)),option!$E$3*-1),0))","v":0},{"$f":"IF(LEN(C32)=0,0,IFERROR(ROUNDDOWN(HTAX(LEFT(VLOOKUP(C32,표1[],15,0),FIND(\")\",VLOOKUP(C32,표1[],15,0))-1),SUMIF(option!$C$2:$Q$2,0,G32:U32),'사원정보(입력)'!V$8,VLOOKUP(C32,표1[],13,0)),option!$F$3*-1),0))","v":0},{"$f":"IF(Z32=0,0,IF(LEFT(VLOOKUP(C32,표1[],16,0),FIND(\")\",VLOOKUP(C32,표1[],16,0))-1)=\"2\",0,ROUNDDOWN(IF(LEFT(VLOOKUP(C32,표1[],16,0),FIND(\")\",VLOOKUP(C32,표1[],16,0))-1)=\"1\",Z32*('사원정보(입력)'!V$9/100),Z32*('사원정보(입력)'!V$9/100)*(1-((LEFT(VLOOKUP(C32,표1[],16,0),FIND(\")\",VLOOKUP(C32,표1[],16,0))-1)-2)/10))),option!$G$3*-1)))","v":0},{"$f":"IF(LEN(C32)=0,0,IF(LEFT(VLOOKUP(C32,표1[],17,0),1)=\"2\",0,ROUNDDOWN(SUMIF(option!$C$2:$Q$2,0,G32:U32)*('사원정보(입력)'!V$10/100),option!$H$3*-1)))","v":{"$error":"#N/A"}},"","",null,null,null,null,null,null,null,{"$error":"#N/A"},{"$error":"#N/A"}]
[null,28,{"$f":"'사원정보(입력)'!B34","v":0},{"$f":"IFERROR(VLOOKUP(C33,표1[],2,0),\"\")","v":""},{"$f":"IFERROR(VLOOKUP(C33,표1[],3,0),\"\")","v":""},{"$f":"IFERROR(VLOOKUP(C33,표1[],4,0),\"\")","v":""},{"$f":"IFERROR(VLOOKUP(C33,표1[],11,0),0)","v":0},null,null,null,null,null,null,null,null,null,null,null,null,null,null,0,{"$f":"IF(LEN(C33)=0,0,IFERROR(IF(LEN(VLOOKUP(C33,표1[],18,0))=0,0,ROUNDDOWN(CHOOSE(LEFT(VLOOKUP(C33,표1[],18,0),1),INTAX(SUMIF(option!$C$2:$Q$2,0,G33:U33),VLOOKUP(C33,표1[],9,0),VLOOKUP(C33,표1[],10,0)),INTAX(SUMIF(option!$C$2:$Q$2,0,G33:U33),VLOOKUP(C33,표1[],9,0),VLOOKUP(C33,표1[],10,0))*1.2,INTAX(SUMIF(option!$C$2:$Q$2,0,G33:U33),VLOOKUP(C33,표1[],9,0),VLOOKUP(C33,표1[],10,0))*0.8,V33*(('사원정보(입력)'!V$13/1.1)/100),V33*(('사원정보(입력)'!V$14/1.1)/100)),option!$C$3*-1)),0))","v":0},{"$f":"IF(W33=0,0,ROUNDDOWN(W33*0.1,option!$D$3*-1))","v":0},{"$f":"IF(LEN(C33)=0,0,IFERROR(ROUNDDOWN(ctax(LEFT(VLOOKUP(C33,표1[],14,0),FIND(\")\",VLOOKUP(C33,표1[],14,0))-1),SUMIF(option!$C$2:$Q$2,0,G33:U33),'사원정보(입력)'!V$7,VLOOKUP(C33,표1[],12,0)),option!$E$3*-1),0))","v":0},{"$f":"IF(LEN(C33)=0,0,IFERROR(ROUNDDOWN(HTAX(LEFT(VLOOKUP(C33,표1[],15,0),FIND(\")\",VLOOKUP(C33,표1[],15,0))-1),SUMIF(option!$C$2:$Q$2,0,G33:U33),'사원정보(입력)'!V$8,VLOOKUP(C33,표1[],13,0)),option!$F$3*-1),0))","v":0},{"$f":"IF(Z33=0,0,IF(LEFT(VLOOKUP(C33,표1[],16,0),FIND(\")\",VLOOKUP(C33,표1[],16,0))-1)=\"2\",0,ROUNDDOWN(IF(LEFT(VLOOKUP(C33,표1[],16,0),FIND(\")\",VLOOKUP(C33,표1[],16,0))-1)=\"1\",Z33*('사원정보(입력)'!V$9/100),Z33*('사원정보(입력)'!V$9/100)*(1-((LEFT(VLOOKUP(C33,표1[],16,0),FIND(\")\",VLOOKUP(C33,표1[],16,0))-1)-2)/10))),option!$G$3*-1)))","v":0},{"$f":"IF(LEN(C33)=0,0,IF(LEFT(VLOOKUP(C33,표1[],17,0),1)=\"2\",0,ROUNDDOWN(SUMIF(option!$C$2:$Q$2,0,G33:U33)*('사원정보(입력)'!V$10/100),option!$H$3*-1)))","v":{"$error":"#N/A"}},"","",null,null,null,null,null,null,null,{"$error":"#N/A"},{"$error":"#N/A"}]
[null,29,{"$f":"'사원정보(입력)'!B35","v":0},{"$f":"IFERROR(VLOOKUP(C34,표1[],2,0),\"\")","v":""},{"$f":"IFERROR(VLOOKUP(C34,표1[],3,0),\"\")","v":""},{"$f":"IFERROR(VLOOKUP(C34,표1[],4,0),\"\")","v":""},{"$f":"IFERROR(VLOOKUP(C34,표1[],11,0),0)","v":0},null,null,null,null,null,null,null,null,null,null,null,null,null,null,0,{"$f":"IF(LEN(C34)=0,0,IFERROR(IF(LEN(VLOOKUP(C34,표1[],18,0))=0,0,ROUNDDOWN(CHOOSE(LEFT(VLOOKUP(C34,표1[],18,0),1),INTAX(SUMIF(option!$C$2:$Q$2,0,G34:U34),VLOOKUP(C34,표1[],9,0),VLOOKUP(C34,표1[],10,0)),INTAX(SUMIF(option!$C$2:$Q$2,0,G34:U34),VLOOKUP(C34,표1[],9,0),VLOOKUP(C34,표1[],10,0))*1.2,INTAX(SUMIF(option!$C$2:$Q$2,0,G34:U34),VLOOKUP(C34,표1[],9,0),VLOOKUP(C34,표1[],10,0))*0.8,V34*(('사원정보(입력)'!V$13/1.1)/100),V34*(('사원정보(입력)'!V$14/1.1)/100)),option!$C$3*-1)),0))","v":0},{"$f":"IF(W34=0,0,ROUNDDOWN(W34*0.1,option!$D$3*-1))","v":0},{"$f":"IF(LEN(C34)=0,0,IFERROR(ROUNDDOWN(ctax(LEFT(VLOOKUP(C34,표1[],14,0),FIND(\")\",VLOOKUP(C34,표1[],14,0))-1),SUMIF(option!$C$2:$Q$2,0,G34:U34),'사원정보(입력)'!V$7,VLOOKUP(C34,표1[],12,0)),option!$E$3*-1),0))","v":0},{"$f":"IF(LEN(C34)=0,0,IFERROR(ROUNDDOWN(HTAX(LEFT(VLOOKUP(C34,표1[],15,0),FIND(\")\",VLOOKUP(C34,표1[],15,0))-1),SUMIF(option!$C$2:$Q$2,0,G34:U34),'사원정보(입력)'!V$8,VLOOKUP(C34,표1[],13,0)),option!$F$3*-1),0))","v":0},{"$f":"IF(Z34=0,0,IF(LEFT(VLOOKUP(C34,표1[],16,0),FIND(\")\",VLOOKUP(C34,표1[],16,0))-1)=\"2\",0,ROUNDDOWN(IF(LEFT(VLOOKUP(C34,표1[],16,0),FIND(\")\",VLOOKUP(C34,표1[],16,0))-1)=\"1\",Z34*('사원정보(입력)'!V$9/100),Z34*('사원정보(입력)'!V$9/100)*(1-((LEFT(VLOOKUP(C34,표1[],16,0),FIND(\")\",VLOOKUP(C34,표1[],16,0))-1)-2)/10))),option!$G$3*-1)))","v":0},{"$f":"IF(LEN(C34)=0,0,IF(LEFT(VLOOKUP(C34,표1[],17,0),1)=\"2\",0,ROUNDDOWN(SUMIF(option!$C$2:$Q$2,0,G34:U34)*('사원정보(입력)'!V$10/100),option!$H$3*-1)))","v":{"$error":"#N/A"}},"","",null,null,null,null,null,null,null,{"$error":"#N/A"},{"$error":"#N/A"}]
[null,30,{"$f":"'사원정보(입력)'!B36","v":0},{"$f":"IFERROR(VLOOKUP(C35,표1[],2,0),\"\")","v":""},{"$f":"IFERROR(VLOOKUP(C35,표1[],3,0),\"\")","v":""},{"$f":"IFERROR(VLOOKUP(C35,표1[],4,0),\"\")","v":""},{"$f":"IFERROR(VLOOKUP(C35,표1[],11,0),0)","v":0},null,null,null,null,null,null,null,null,null,null,null,null,null,null,0,{"$f":"IF(LEN(C35)=0,0,IFERROR(IF(LEN(VLOOKUP(C35,표1[],18,0))=0,0,ROUNDDOWN(CHOOSE(LEFT(VLOOKUP(C35,표1[],18,0),1),INTAX(SUMIF(option!$C$2:$Q$2,0,G35:U35),VLOOKUP(C35,표1[],9,0),VLOOKUP(C35,표1[],10,0)),INTAX(SUMIF(option!$C$2:$Q$2,0,G35:U35),VLOOKUP(C35,표1[],9,0),VLOOKUP(C35,표1[],10,0))*1.2,INTAX(SUMIF(option!$C$2:$Q$2,0,G35:U35),VLOOKUP(C35,표1[],9,0),VLOOKUP(C35,표1[],10,0))*0.8,V35*(('사원정보(입력)'!V$13/1.1)/100),V35*(('사원정보(입력)'!V$14/1.1)/100)),option!$C$3*-1)),0))","v":0},{"$f":"IF(W35=0,0,ROUNDDOWN(W35*0.1,option!$D$3*-1))","v":0},{"$f":"IF(LEN(C35)=0,0,IFERROR(ROUNDDOWN(ctax(LEFT(VLOOKUP(C35,표1[],14,0),FIND(\")\",VLOOKUP(C35,표1[],14,0))-1),SUMIF(option!$C$2:$Q$2,0,G35:U35),'사원정보(입력)'!V$7,VLOOKUP(C35,표1[],12,0)),option!$E$3*-1),0))","v":0},{"$f":"IF(LEN(C35)=0,0,IFERROR(ROUNDDOWN(HTAX(LEFT(VLOOKUP(C35,표1[],15,0),FIND(\")\",VLOOKUP(C35,표1[],15,0))-1),SUMIF(option!$C$2:$Q$2,0,G35:U35),'사원정보(입력)'!V$8,VLOOKUP(C35,표1[],13,0)),option!$F$3*-1),0))","v":0},{"$f":"IF(Z35=0,0,IF(LEFT(VLOOKUP(C35,표1[],16,0),FIND(\")\",VLOOKUP(C35,표1[],16,0))-1)=\"2\",0,ROUNDDOWN(IF(LEFT(VLOOKUP(C35,표1[],16,0),FIND(\")\",VLOOKUP(C35,표1[],16,0))-1)=\"1\",Z35*('사원정보(입력)'!V$9/100),Z35*('사원정보(입력)'!V$9/100)*(1-((LEFT(VLOOKUP(C35,표1[],16,0),FIND(\")\",VLOOKUP(C35,표1[],16,0))-1)-2)/10))),option!$G$3*-1)))","v":0},{"$f":"IF(LEN(C35)=0,0,IF(LEFT(VLOOKUP(C35,표1[],17,0),1)=\"2\",0,ROUNDDOWN(SUMIF(option!$C$2:$Q$2,0,G35:U35)*('사원정보(입력)'!V$10/100),option!$H$3*-1)))","v":{"$error":"#N/A"}},"","",null,null,null,null,null,null,null,{"$error":"#N/A"},{"$error":"#N/A"}]
[null,"합          계",null,null,null,null,{"$f":"SUM(G6:G23)","v":15500000},500000,0,3000000,9000000,1050000,300000,600000,700000,600000,400000,0,0,0,0,31650000,534080,53408,769500,586530,67566,{"$error":"#N/A"},71348.45454545453,34485,200000,150000,0,650000,0,0,0,{"$error":"#N/A"},{"$error":"#N/A"}]

{"sheet":"급여명세서","index":2,"n_rows":27,"n_cols":7,"rows_kept":27,"cut":false,"hidden":false,"merged":[[24,4,24,6],[25,1,25,6],[9,4,9,5],[10,4,10,5],[11,4,11,5],[13,4,13,5],[7,1,14,1],[15,1,22,1],[26,1,26,6],[3,1,3,6],[14,4,14,5],[15,4,15,5],[16,4,16,5],[17,4,17,5],[18,4,18,5],[19,4,19,5],[20,4,20,5],[21,4,21,5],[12,4,12,5],[6,1,6,6],[7,4,7,5],[8,4,8,5],[22,4,22,5],[24,1,24,3],[4,2,4,3],[4,5,4,6],[5,2,5,3],[5,5,5,6],[2,1,2,3],[2,4,2,6]]}
["급여명세서(근로소득/사업소득) (자동 정산서식)"]
[]
[null,{"$f":"'급여대장(입력)'!B3","v":"2021년 8월"},null,null,"급여명세서"]
[]
[null,"사원명","오",null,"계약구분","지입"]
[null,"귀속연월",{"$f":"'급여대장(입력)'!B3","v":"2021년 8월"},null,"직책","SM"]
[]
[null,"지\n\n급\n\n내\n\n역","기본급",0,"연장근로수당"]
[null,null,"식대",null,"근속수당"]
[null,null,"개발수수료",null,"직책수당",null,100000]
[null,null,"집하수수료",1000000,""]
[null,null,"배송수수료",3000000,""]
[null,null,"분류비",350000,""]
[null,null,"유류지원금",null,""]
[null,null,"교통비"]
[null,"공\n\n제\n\n내\n\n역","소득세",0,"운송장",null,100000]
[null,null,"지방소득세",0,"포장 테이프",null,50000]
[null,null,"국민연금",0,"전산장비"]
[null,null,"건강보험",0,"화물사고 분담",null,300000]
[null,null,"노인장기요양",0,""]
[null,null,"고용보험(근로)",null,""]
[null,null,"고용보험(특고)",22597.909090909085,""]
[null,null,"산재보험(특고)",11495,"합 계",null,{"$f":"D16+D17+D18+D19+D20+D21+D22+D23+G16+G17+G18+G19+G20+G21+G22","v":484092.90909090906}]
[]
[null,"실     지     급     액",null,null,{"$f":"G15-G23","v":-484092.90909090906}]
[null,"  귀하의 노고에 깊이 감사드립니다."]
[null,"롯데택배 0 0 0 대리점"]

{"sheet":"4대보험료 계산","index":3,"n_rows":52,"n_cols":26,"rows_kept":52,"cut":false,"hidden":false,"merged":[[39,3,40,3],[36,3,36,4],[37,3,37,4],[38,3,38,4],[36,2,40,2],[36,5,36,9],[37,5,37,9],[38,5,38,9],[39,5,39,9],[40,5,40,9],[34,1,34,2],[4,8,4,9],[4,10,5,10],[3,1,5,1],[3,2,5,2],[3,3,3,5],[3,6,3,10],[4,3,5,3],[4,4,5,4],[4,5,5,5],[4,6,4,7],[3,20,3,25],[4,20,4,22],[4,23,4,25],[4,15,5,15],[37,11,37,13],[37,14,37,15],[3,11,3,15],[4,19,5,19],[3,16,3,19],[4,17,4,18],[36,18,36,19],[37,18,37,19],[4,11,4,12],[4,13,4,14],[48,2,51,2],[48,3,48,4],[48,5,48,9],[49,3,49,4],[49,5,49,9],[50,3,50,4],[50,5,50,9],[51,5,51,9],[51,3,51,4],[42,2,46,2],[42,3,42,4],[42,5,42,9],[43,3,43,4],[43,5,43,9],[44,3,44,4],[44,5,44,9],[45,3,46,3],[45,5,45,9],[46,5,46,9],[38,18,38,19],[39,18,39,19],[40,18,40,19],[40,14,40,15],[36,11,36,13],[36,14,36,15],[36,16,36,17],[37,16,37,17],[38,16,38,17],[39,16,39,17],[40,16,40,17],[39,11,39,13],[39,14,39,15],[40,11,40,13],[38,11,38,13],[38,14,38,15]]}
["4대 사회보험료 내역서 (자동 정산서식/입력 금지)"]
[]
[null,{"$f":"'급여대장(입력)'!B3","v":"2021년 8월"},null,null,null,null,null,null,null,null,null,null,null,null,null,null,null,null,null,null,null,null,null,null,null,"(단위:원, VAT포함)"]
[null,"성명","월소득\n(기준)","국민연금",null,null,"건강보험",null,null,null,null,"고용보험",null,null,null,null,"산재보험",null,null,null,"4대보험료 합계"]
[null,null,null,"회사","근로자","합계","회사",null,"근로자",null,"합계","근로자(고용보험+직무개발)",null,"특고직",null,"합계","근로자","특고직",null,"합계","근로자",null,null,"특고직"]
[null,null,null,null,null,null,"건강보험료","장기요양보험","건강보험료","장기요양보험",null,"회사","근로자","회사","특고직",null,"회사","회사","특고직",null,"회사","근로자","합계","회사","특고직","합계"]
[null,{"$f":"표1[[#This Row],[사원명]]","v":"홍길동"},{"$f":"'급여대장(입력)'!V6-100000","v":2900000},{"$f":"E7","v":130500},{"$f":"'급여대장(입력)'!Y6","v":130500},{"$f":"SUM(D7:E7)","v":261000},{"$f":"'급여대장(입력)'!Z6","v":99470},{"$f":"'급여대장(입력)'!AA6","v":11458},{"$f":"G7","v":99470},{"$f":"H7","v":11458},{"$f":"SUM(G7:J7)","v":221856},{"$f":"((M7/0.8%)*1.05%)","v":30450.000000000004},{"$f":"'급여대장(입력)'!AB6","v":23200},{"$f":"O7","v":""},{"$f":"'급여대장(입력)'!AC6","v":""},{"$f":"SUM(L7:O7)","v":53650},{"$f":"IF('급여대장(입력)'!E6=\"직영\",((C7*19.63)/1000),\"\")","v":""},{"$f":"S7","v":""},{"$f":"IF('급여대장(입력)'!E6=\"지입\",11495,\"\")","v":""},{"$f":"SUM(Q7:S7)","v":0},{"$f":"D7+G7+H7+L7","v":271878},{"$f":"E7+I7+J7+M7","v":264628},{"$f":"U7+V7","v":536506},null,null,{"$f":"X7+Y7","v":0}]
[null,{"$f":"표1[[#This Row],[사원명]]","v":"아무개"},{"$f":"'급여대장(입력)'!V7-100000","v":2800000},126000,{"$f":"'급여대장(입력)'!Y7","v":126000},{"$f":"SUM(D8:E8)","v":252000},{"$f":"'급여대장(입력)'!Z7","v":96040},{"$f":"'급여대장(입력)'!AA7","v":11063},{"$f":"G8","v":96040},{"$f":"H8","v":11063},{"$f":"SUM(G8:J8)","v":214206},{"$f":"((M8/0.8%)*1.05%)","v":29400.000000000004},{"$f":"'급여대장(입력)'!AB7","v":22400},"",{"$f":"'급여대장(입력)'!AC7","v":""},{"$f":"SUM(L8:O8)","v":51800},{"$f":"IF('급여대장(입력)'!E7=\"직영\",((C8*19.63)/1000),\"\")","v":""},"",{"$f":"IF('급여대장(입력)'!E7=\"지입\",11495,\"\")","v":""},0,{"$f":"D8+G8+H8+L8","v":262503},{"$f":"E8+I8+J8+M8","v":255503},{"$f":"U8+V8","v":518006},null,null,0]
[null,{"$f":"표1[[#This Row],[사원명]]","v":"김"},{"$f":"'급여대장(입력)'!V8-100000","v":3900000},175500,{"$f":"'급여대장(입력)'!Y8","v":175500},351000,{"$f":"'급여대장(입력)'!Z8","v":133770},{"$f":"'급여대장(입력)'!AA8","v":15410},{"$f":"G9","v":133770},{"$f":"H9","v":15410},298360,{"$f":"((M9/0.8%)*1.05%)","v":40950},{"$f":"'급여대장(입력)'!AB8","v":31200},"",{"$f":"'급여대장(입력)'!AC8","v":""},{"$f":"SUM(L9:O9)","v":72150},{"$f":"IF('급여대장(입력)'!E8=\"직영\",((C9*19.63)/1000),\"\")","v":76557},"",{"$f":"IF('급여대장(입력)'!E8=\"지입\",11495,\"\")","v":""},{"$f":"SUM(Q9:S9)","v":76557},{"$f":"D9+G9+H9+L9","v":365630},{"$f":"E9+I9+J9+M9","v":355880},{"$f":"U9+V9","v":721510},null,null,0]
[null,{"$f":"표1[[#This Row],[사원명]]","v":"이"},{"$f":"'급여대장(입력)'!V9-100000","v":3800000},{"$f":"E10","v":171000},{"$f":"'급여대장(입력)'!Y9","v":171000},342000,{"$f":"'급여대장(입력)'!Z9","v":130340},{"$f":"'급여대장(입력)'!AA9","v":15015},130340,15015,290710,39900,{"$f":"'급여대장(입력)'!AB9","v":30400},"",{"$f":"'급여대장(입력)'!AC9","v":""},70300,{"$f":"IF('급여대장(입력)'!E9=\"직영\",((C10*19.63)/1000),\"\")","v":74594},"",{"$f":"IF('급여대장(입력)'!E9=\"지입\",11495,\"\")","v":""},74594,356255,346755,703010,null,null,0]
[null,{"$f":"표1[[#This Row],[사원명]]","v":"박"},{"$f":"'급여대장(입력)'!V10","v":3800000},{"$f":"E11","v":166500},{"$f":"'급여대장(입력)'!Y10","v":166500},333000,{"$f":"'급여대장(입력)'!Z10","v":126910},{"$f":"'급여대장(입력)'!AA10","v":14620},{"$f":"G11","v":126910},{"$f":"H11","v":14620},283060,38850,{"$f":"'급여대장(입력)'!AB10","v":29600},"",{"$f":"'급여대장(입력)'!AC10","v":""},{"$f":"SUM(M11:O11)","v":29600},{"$f":"IF('급여대장(입력)'!E10=\"직영\",((C11*19.63)/1000),\"\")","v":74594},{"$f":"S11","v":""},{"$f":"IF('급여대장(입력)'!E10=\"지입\",11495,\"\")","v":""},74594,346880,337630,{"$f":"U11+V11","v":684510},null,null,0]
[null,{"$f":"표1[[#This Row],[사원명]]","v":"오"},{"$f":"'급여대장(입력)'!V11","v":4450000},0,{"$f":"'급여대장(입력)'!Y11","v":0},{"$f":"SUM(D12:E12)","v":0},{"$f":"'급여대장(입력)'!Z11","v":0},{"$f":"'급여대장(입력)'!AA11","v":0},0,0,{"$f":"SUM(G12:J12)","v":0},0,{"$f":"'급여대장(입력)'!AB11","v":0},22597.909090909085,{"$f":"'급여대장(입력)'!AC11","v":22597.909090909085},{"$f":"SUM(M12:O12)","v":45195.818181818169},{"$f":"IF('급여대장(입력)'!E11=\"직영\",((C12*19.63)/1000),\"\")","v":""},{"$f":"S12","v":11495},{"$f":"IF('급여대장(입력)'!E11=\"지입\",11495,\"\")","v":11495},22990,0,0,0,{"$f":"N12+R12","v":34092.909090909088},{"$f":"O12+S12","v":34092.909090909088},{"$f":"X12+Y12","v":68185.818181818177}]
[null,{"$f":"표1[[#This Row],[사원명]]","v":"최"},{"$f":"'급여대장(입력)'!V12-100000","v":4650000},0,{"$f":"'급여대장(입력)'!Y12","v":0},0,{"$f":"'급여대장(입력)'!Z12","v":0},{"$f":"'급여대장(입력)'!AA12","v":0},0,0,0,{"$f":"((M13/0.8%)*1.05%)","v":0},{"$f":"'급여대장(입력)'!AB12","v":0},24121.363636363625,{"$f":"'급여대장(입력)'!AC12","v":24121.363636363625},{"$f":"SUM(L13:O13)","v":48242.72727272725},{"$f":"IF('급여대장(입력)'!E12=\"직영\",((C13*19.63)/1000),\"\")","v":""},11495,{"$f":"IF('급여대장(입력)'!E12=\"지입\",11495,\"\")","v":11495},22990,0,0,0,{"$f":"N13+R13","v":35616.363636363625},{"$f":"O13+S13","v":35616.363636363625},{"$f":"X13+Y13","v":71232.72727272725}]
[null,{"$f":"표1[[#This Row],[사원명]]","v":"권"},{"$f":"'급여대장(입력)'!V13","v":4850000},0,{"$f":"'급여대장(입력)'!Y13","v":0},0,{"$f":"'급여대장(입력)'!Z13","v":0},{"$f":"'급여대장(입력)'!AA13","v":0},0,0,0,0,{"$f":"'급여대장(입력)'!AB13","v":0},24629.181818181816,{"$f":"'급여대장(입력)'!AC13","v":24629.181818181816},{"$f":"SUM(M14:O14)","v":49258.363636363632},{"$f":"IF('급여대장(입력)'!E13=\"직영\",((C14*19.63)/1000),\"\")","v":""},11495,{"$f":"IF('급여대장(입력)'!E13=\"지입\",11495,\"\")","v":11495},22990,0,{"$f":"E14+I14+J14+M14","v":0},0,36124.181818181816,36124.181818181816,{"$f":"X14+Y14","v":72248.363636363632}]
[null,null,{"$f":"'급여대장(입력)'!V14","v":0},0,{"$f":"'급여대장(입력)'!Y14","v":0},0,{"$f":"'급여대장(입력)'!Z14","v":0},{"$f":"'급여대장(입력)'!AA14","v":0},0,0,0,null,null,"",{"$f":"'급여대장(입력)'!AC14","v":""},0,{"$f":"IF('급여대장(입력)'!E14=\"직영\",((C15*19.63)/1000),\"\")","v":""},"",{"$f":"IF('급여대장(입력)'!E14=\"지입\",11495,\"\")","v":""},0,0,0,0,null,null,0]
[null,null,{"$f":"'급여대장(입력)'!V15","v":0},0,{"$f":"'급여대장(입력)'!Y15","v":0},0,{"$f":"'급여대장(입력)'!Z15","v":0},{"$f":"'급여대장(입력)'!AA15","v":0},0,0,0,null,null,"",{"$f":"'급여대장(입력)'!AC15","v":""},0,{"$f":"IF('급여대장(입력)'!E15=\"직영\",((C16*19.63)/1000),\"\")","v":""},"",{"$f":"IF('급여대장(입력)'!E15=\"지입\",11495,\"\")","v":""},0,0,0,0,null,null,0]
[null,null,{"$f":"'급여대장(입력)'!V16","v":0},0,{"$f":"'급여대장(입력)'!Y16","v":0},0,{"$f":"'급여대장(입력)'!Z16","v":0},{"$f":"'급여대장(입력)'!AA16","v":0},0,0,0,null,null,"",{"$f":"'급여대장(입력)'!AC16","v":""},0,{"$f":"IF('급여대장(입력)'!E16=\"직영\",((C17*19.63)/1000),\"\")","v":""},"",{"$f":"IF('급여대장(입력)'!E16=\"지입\",11495,\"\")","v":""},0,0,0,0,null,null,0]
[null,null,{"$f":"'급여대장(입력)'!V17","v":0},0,{"$f":"'급여대장(입력)'!Y17","v":0},0,{"$f":"'급여대장(입력)'!Z17","v":0},{"$f":"'급여대장(입력)'!AA17","v":0},0,0,0,null,null,"",{"$f":"'급여대장(입력)'!AC17","v":""},0,{"$f":"IF('급여대장(입력)'!E17=\"직영\",((C18*19.63)/1000),\"\")","v":""},"",{"$f":"IF('급여대장(입력)'!E17=\"지입\",11495,\"\")","v":""},0,0,0,0,null,null,0]
[null,null,{"$f":"'급여대장(입력)'!V18","v":0},0,{"$f":"'급여대장(입력)'!Y18","v":0},0,{"$f":"'급여대장(입력)'!Z18","v":0},{"$f":"'급여대장(입력)'!AA18","v":0},0,0,0,null,null,"",{"$f":"'급여대장(입력)'!AC18","v":""},0,{"$f":"IF('급여대장(입력)'!E18=\"직영\",((C19*19.63)/1000),\"\")","v":""},"",{"$f":"IF('급여대장(입력)'!E18=\"지입\",11495,\"\")","v":""},0,0,0,0,null,null,0]
[null,null,{"$f":"'급여대장(입력)'!V19","v":0},0,{"$f":"'급여대장(입력)'!Y19","v":0},0,{"$f":"'급여대장(입력)'!Z19","v":0},{"$f":"'급여대장(입력)'!AA19","v":0},0,0,0,null,null,"",{"$f":"'급여대장(입력)'!AC19","v":""},0,{"$f":"IF('급여대장(입력)'!E19=\"직영\",((C20*19.63)/1000),\"\")","v":""},"",{"$f":"IF('급여대장(입력)'!E19=\"지입\",11495,\"\")","v":""},0,0,0,0,null,null,0]
[null,null,{"$f":"'급여대장(입력)'!V20","v":0},0,{"$f":"'급여대장(입력)'!Y20","v":0},0,{"$f":"'급여대장(입력)'!Z20","v":0},{"$f":"'급여대장(입력)'!AA20","v":0},0,0,0,null,null,"",{"$f":"'급여대장(입력)'!AC20","v":""},0,{"$f":"IF('급여대장(입력)'!E20=\"직영\",((C21*19.63)/1000),\"\")","v":""},"",{"$f":"IF('급여대장(입력)'!E20=\"지입\",11495,\"\")","v":""},0,0,0,0,null,null,0]
[null,null,{"$f":"'급여대장(입력)'!V21","v":0},0,{"$f":"'급여대장(입력)'!Y21","v":0},0,{"$f":"'급여대장(입력)'!Z21","v":0},{"$f":"'급여대장(입력)'!AA21","v":0},0,0,0,null,null,"",{"$f":"'급여대장(입력)'!AC21","v":""},0,{"$f":"IF('급여대장(입력)'!E21=\"직영\",((C22*19.63)/1000),\"\")","v":""},"",{"$f":"IF('급여대장(입력)'!E21=\"지입\",11495,\"\")","v":""},0,0,0,0,null,null,0]
[null,null,{"$f":"'급여대장(입력)'!V22","v":0},0,{"$f":"'급여대장(입력)'!Y22","v":0},0,{"$f":"'급여대장(입력)'!Z22","v":0},{"$f":"'급여대장(입력)'!AA22","v":0},0,0,0,null,null,"",{"$f":"'급여대장(입력)'!AC22","v":""},0,{"$f":"IF('급여대장(입력)'!E22=\"직영\",((C23*19.63)/1000),\"\")","v":""},"",{"$f":"IF('급여대장(입력)'!E22=\"지입\",11495,\"\")","v":""},0,0,0,0,null,null,0]
[null,null,{"$f":"'급여대장(입력)'!V23","v":0},0,{"$f":"'급여대장(입력)'!Y23","v":0},0,{"$f":"'급여대장(입력)'!Z23","v":0},{"$f":"'급여대장(입력)'!AA23","v":0},0,0,0,null,null,"",{"$f":"'급여대장(입력)'!AC23","v":""},0,{"$f":"IF('급여대장(입력)'!E23=\"직영\",((C24*19.63)/1000),\"\")","v":""},"",{"$f":"IF('급여대장(입력)'!E23=\"지입\",11495,\"\")","v":""},0,0,0,0,null,null,0]
[null,null,{"$f":"'급여대장(입력)'!V24","v":0},0,{"$f":"'급여대장(입력)'!Y24","v":0},0,{"$f":"'급여대장(입력)'!Z24","v":0},{"$f":"'급여대장(입력)'!AA24","v":0},0,0,0,null,null,"",{"$f":"'급여대장(입력)'!AC24","v":""},0,{"$f":"IF('급여대장(입력)'!E24=\"직영\",((C25*19.63)/1000),\"\")","v":""},"",{"$f":"IF('급여대장(입력)'!E24=\"지입\",11495,\"\")","v":""},0,0,0,0,null,null,0]
[null,null,{"$f":"'급여대장(입력)'!V25","v":0},0,{"$f":"'급여대장(입력)'!Y25","v":0},{"$f":"SUM(D26:E26)","v":0},{"$f":"'급여대장(입력)'!Z25","v":0},{"$f":"'급여대장(입력)'!AA25","v":0},{"$f":"G26","v":0},{"$f":"H26","v":0},{"$f":"SUM(G26:J26)","v":0},null,null,"",{"$f":"'급여대장(입력)'!AC25","v":""},{"$f":"SUM(L26:O26)","v":0},{"$f":"IF('급여대장(입력)'!E25=\"직영\",((C26*19.63)/1000),\"\")","v":""},{"$f":"S26","v":""},{"$f":"IF('급여대장(입력)'!E25=\"지입\",11495,\"\")","v":""},0,0,0,{"$f":"U26+V26","v":0},null,null,{"$f":"X26+Y26","v":0}]
[null,null,{"$f":"'급여대장(입력)'!V26","v":0},0,{"$f":"'급여대장(입력)'!Y26","v":0},0,{"$f":"'급여대장(입력)'!Z26","v":0},{"$f":"'급여대장(입력)'!AA26","v":0},0,0,0,null,null,"",{"$f":"'급여대장(입력)'!AC26","v":""},0,{"$f":"IF('급여대장(입력)'!E26=\"직영\",((C27*19.63)/1000),\"\")","v":""},"",{"$f":"IF('급여대장(입력)'!E26=\"지입\",11495,\"\")","v":""},0,0,0,0,null,null,0]
[null,null,{"$f":"'급여대장(입력)'!V27","v":0},0,{"$f":"'급여대장(입력)'!Y27","v":0},0,{"$f":"'급여대장(입력)'!Z27","v":0},{"$f":"'급여대장(입력)'!AA27","v":0},0,0,0,null,null,"",{"$f":"'급여대장(입력)'!AC27","v":""},0,{"$f":"IF('급여대장(입력)'!E27=\"직영\",((C28*19.63)/1000),\"\")","v":""},"",{"$f":"IF('급여대장(입력)'!E27=\"지입\",11495,\"\")","v":""},0,0,0,0,null,null,0]
[null,null,{"$f":"'급여대장(입력)'!V28","v":0},0,{"$f":"'급여대장(입력)'!Y28","v":0},0,{"$f":"'급여대장(입력)'!Z28","v":0},{"$f":"'급여대장(입력)'!AA28","v":0},0,0,0,null,null,"",{"$f":"'급여대장(입력)'!AC28","v":""},0,{"$f":"IF('급여대장(입력)'!E28=\"직영\",((C29*19.63)/1000),\"\")","v":""},"",{"$f":"IF('급여대장(입력)'!E28=\"지입\",11495,\"\")","v":""},0,0,0,0,null,null,0]
[null,null,{"$f":"'급여대장(입력)'!V29","v":0},0,{"$f":"'급여대장(입력)'!Y29","v":0},0,{"$f":"'급여대장(입력)'!Z29","v":0},{"$f":"'급여대장(입력)'!AA29","v":0},0,0,0,null,null,"",{"$f":"'급여대장(입력)'!AC29","v":""},0,{"$f":"IF('급여대장(입력)'!E29=\"직영\",((C30*19.63)/1000),\"\")","v":""},"",{"$f":"IF('급여대장(입력)'!E29=\"지입\",11495,\"\")","v":""},0,0,0,0,null,null,0]
[null,null,{"$f":"'급여대장(입력)'!V30","v":0},0,{"$f":"'급여대장(입력)'!Y30","v":0},0,{"$f":"'급여대장(입력)'!Z30","v":0},{"$f":"'급여대장(입력)'!AA30","v":0},0,0,0,null,null,"",{"$f":"'급여대장(입력)'!AC30","v":""},0,{"$f":"IF('급여대장(입력)'!E30=\"직영\",((C31*19.63)/1000),\"\")","v":""},"",{"$f":"IF('급여대장(입력)'!E30=\"지입\",11495,\"\")","v":""},0,0,0,0,null,null,0]
[null,null,{"$f":"'급여대장(입력)'!V31","v":0},0,{"$f":"'급여대장(입력)'!Y31","v":0},0,{"$f":"'급여대장(입력)'!Z31","v":0},{"$f":"'급여대장(입력)'!AA31","v":0},0,0,0,null,null,"",{"$f":"'급여대장(입력)'!AC31","v":""},0,{"$f":"IF('급여대장(입력)'!E31=\"직영\",((C32*19.63)/1000),\"\")","v":""},"",{"$f":"IF('급여대장(입력)'!E31=\"지입\",11495,\"\")","v":""},0,0,0,0,null,null,0]
[null,null,{"$f":"'급여대장(입력)'!V32","v":0},0,{"$f":"'급여대장(입력)'!Y32","v":0},0,{"$f":"'급여대장(입력)'!Z32","v":0},{"$f":"'급여대장(입력)'!AA32","v":0},0,0,0,null,null,"",{"$f":"'급여대장(입력)'!AC32","v":""},0,{"$f":"IF('급여대장(입력)'!E32=\"직영\",((C33*19.63)/1000),\"\")","v":""},"",{"$f":"IF('급여대장(입력)'!E32=\"지입\",11495,\"\")","v":""},0,0,0,0,null,null,0]
[null,null,{"$f":"'급여대장(입력)'!V33","v":0},0,{"$f":"'급여대장(입력)'!Y33","v":0},0,{"$f":"'급여대장(입력)'!Z33","v":0},{"$f":"'급여대장(입력)'!AA33","v":0},0,0,0,null,null,"",{"$f":"'급여대장(입력)'!AC33","v":""},0,{"$f":"IF('급여대장(입력)'!E33=\"직영\",((C34*19.63)/1000),\"\")","v":""},"",{"$f":"IF('급여대장(입력)'!E33=\"지입\",11495,\"\")","v":""},0,0,0,0,null,null,0]
[null,"합계",null,{"$f":"SUM(D7:D34)","v":769500},{"$f":"SUM(E7:E34)","v":769500},{"$f":"+K35+P35+Q35","v":1954133.9090909092},{"$f":"SUM(G7:G34)","v":586530},67566,586530,67566,1308192,179550,{"$f":"SUM(L7:L34)","v":179550},{"$f":"SUM(M7:M34)","v":136800},71348.45454545453,420196.90909090906,225745,34485,34485,294715,1603146,1560396,3163542,105833.45454545453,105833.45454545453,211666.90909090906]
[]
[null,null,"회사","국민연금",null,"기준소득 * 4.5%",null,null,null,null,null,"보험료부담",null,null,"4대보험료 합계",null,"4대보험료 비용 분담 비율",null,"비고"]
[null,null,null,"건강보험",null,"기준소득*건강보험료(3.43%)+건강보험료*장기요양보험(11.52%)",null,null,null,null,null,"근로자",null,null,{"$f":"V35","v":1560396},null,{"$f":"O38/$O$41","v":0.4623109389754137}]
[null,null,null,"산재보험",null,"기준소득*보험요율(19.63%)/1,000",null,null,null,null,null,"특고직",null,null,{"$f":"Y35","v":105833.45454545453},null,{"$f":"O39/$O$41","v":3.1356119693924392E-2}]
[null,null,null,"고용보험","고용보험","기준소득 * 0.8%",null,null,null,null,null,"회사",null,null,{"$f":"U35+X35","v":1708979.4545454546},null,{"$f":"O40/$O$41","v":0.50633294133066187}]
[null,null,null,null,"고용안정","기준소득 * 0.25%",null,null,null,null,null,"합계",null,null,{"$f":"SUM(O38:P40)","v":3375208.9090909092},null,{"$f":"SUM(Q38:Q40)","v":1}]
[]
[null,null,"근로자","국민연금",null,"기준소득 * 4.5%"]
[null,null,null,"건강보험",null,"기준소득*건강보험료(3.43%)+건강보험료*장기요양보험(11.52%)"]
[null,null,null,"산재보험"]
[null,null,null,"고용보험","고용보험","기준소득 * 0.8%"]
[null,null,null,null,"고용안정"]
[]
[null,null,"특고직","국민연금",null,null,null,null,null,null,null,null,null,null,null,null,"ⓒ봄날(http://blog.naver.com/naya6415)"]
[null,null,null,"건강보험"]
[null,null,null,"산재보험",null,"기준소득(242만원) * 보험요율(0.95%)"]
[null,null,null,"고용보험",null,"(총소득/1.1%(부가세) * 79.8%) * 보험요율(0.7%)"]

{"sheet":"2021_근로소득간이세액표","index":4,"n_rows":664,"n_cols":13,"rows_kept":664,"cut":false,"hidden":false,"merged":[[659,0,659,1],[0,0,0,12],[1,0,1,12],[2,0,2,1],[2,2,2,12],[3,0,3,1],[651,0,651,1],[660,2,661,12],[661,0,661,1],[662,0,662,1],[662,2,662,12],[652,0,652,1],[652,2,653,12],[653,0,653,1],[654,0,654,1],[654,2,655,12],[655,0,655,1],[656,0,656,1],[656,2,657,12],[657,0,657,1],[660,0,660,1],[658,0,658,1],[658,2,659,12]]}
["근로소득 간이세액표(제189조 제1항 관련)"]
["(단위: 원)"]
["월급여액(천원)",null,"공제대상가족의 수"]
["[비과세 및 학자금 제외］",null,1,2,3,4,5,6,7,8,9,10,11]
["이상","미만"]
[770,775,"-","-","-","-","-","-","-","-","-","-","-"]
[775,780,"-","-","-","-","-","-","-","-","-","-","-"]
[780,785,"-","-","-","-","-","-","-","-","-","-","-"]
[785,790,"-","-","-","-","-","-","-","-","-","-","-"]
[790,795,"-","-","-","-","-","-","-","-","-","-","-"]
[795,800,"-","-","-","-","-","-","-","-","-","-","-"]
[800,805,"-","-","-","-","-","-","-","-","-","-","-"]
[805,810,"-","-","-","-","-","-","-","-","-","-","-"]
[810,815,"-","-","-","-","-","-","-","-","-","-","-"]
[815,820,"-","-","-","-","-","-","-","-","-","-","-"]
[820,825,"-","-","-","-","-","-","-","-","-","-","-"]
[825,830,"-","-","-","-","-","-","-","-","-","-","-"]
[830,835,"-","-","-","-","-","-","-","-","-","-","-"]
[835,840,"-","-","-","-","-","-","-","-","-","-","-"]
[840,845,"-","-","-","-","-","-","-","-","-","-","-"]
[845,850,"-","-","-","-","-","-","-","-","-","-","-"]
[850,855,"-","-","-","-","-","-","-","-","-","-","-"]
[855,860,"-","-","-","-","-","-","-","-","-","-","-"]
[860,865,"-","-","-","-","-","-","-","-","-","-","-"]
[865,870,"-","-","-","-","-","-","-","-","-","-","-"]
[870,875,"-","-","-","-","-","-","-","-","-","-","-"]
[875,880,"-","-","-","-","-","-","-","-","-","-","-"]
[880,885,"-","-","-","-","-","-","-","-","-","-","-"]
[885,890,"-","-","-","-","-","-","-","-","-","-","-"]
[890,895,"-","-","-","-","-","-","-","-","-","-","-"]
[895,900,"-","-","-","-","-","-","-","-","-","-","-"]
[900,905,"-","-","-","-","-","-","-","-","-","-","-"]
[905,910,"-","-","-","-","-","-","-","-","-","-","-"]
[910,915,"-","-","-","-","-","-","-","-","-","-","-"]
[915,920,"-","-","-","-","-","-","-","-","-","-","-"]
[920,925,"-","-","-","-","-","-","-","-","-","-","-"]
[925,930,"-","-","-","-","-","-","-","-","-","-","-"]
[930,935,"-","-","-","-","-","-","-","-","-","-","-"]
[935,940,"-","-","-","-","-","-","-","-","-","-","-"]
[940,945,"-","-","-","-","-","-","-","-","-","-","-"]
[945,950,"-","-","-","-","-","-","-","-","-","-","-"]
[950,955,"-","-","-","-","-","-","-","-","-","-","-"]
[955,960,"-","-","-","-","-","-","-","-","-","-","-"]
[960,965,"-","-","-","-","-","-","-","-","-","-","-"]
[965,970,"-","-","-","-","-","-","-","-","-","-","-"]
[970,975,"-","-","-","-","-","-","-","-","-","-","-"]
[975,980,"-","-","-","-","-","-","-","-","-","-","-"]
[980,985,"-","-","-","-","-","-","-","-","-","-","-"]
[985,990,"-","-","-","-","-","-","-","-","-","-","-"]
[990,995,"-","-","-","-","-","-","-","-","-","-","-"]
[995,1000,"-","-","-","-","-","-","-","-","-","-","-"]
[1000,1005,"-","-","-","-","-","-","-","-","-","-","-"]
[1005,1010,"-","-","-","-","-","-","-","-","-","-","-"]
[1010,1015,"-","-","-","-","-","-","-","-","-","-","-"]
[1015,1020,"-","-","-","-","-","-","-","-","-","-","-"]
[1020,1025,"-","-","-","-","-","-","-","-","-","-","-"]
[1025,1030,"-","-","-","-","-","-","-","-","-","-","-"]
[1030,1035,"-","-","-","-","-","-","-","-","-","-","-"]
[1035,1040,"-","-","-","-","-","-","-","-","-","-","-"]
[1040,1045,"-","-","-","-","-","-","-","-","-","-","-"]
[1045,1050,"-","-","-","-","-","-","-","-","-","-","-"]
[1050,1055,"-","-","-","-","-","-","-","-","-","-","-"]
[1055,1060,"-","-","-","-","-","-","-","-","-","-","-"]
[1060,1065,1040,"-","-","-","-","-","-","-","-","-","-"]
[1065,1070,1110,"-","-","-","-","-","-","-","-","-","-"]
[1070,1075,1180,"-","-","-","-","-","-","-","-","-","-"]
[1075,1080,1250,"-","-","-","-","-","-","-","-","-","-"]
[1080,1085,1320,"-","-","-","-","-","-","-","-","-","-"]
[1085,1090,1390,"-","-","-","-","-","-","-","-","-","-"]
[1090,1095,1460,"-","-","-","-","-","-","-","-","-","-"]
[1095,1100,1530,"-","-","-","-","-","-","-","-","-","-"]
[1100,1105,1600,"-","-","-","-","-","-","-","-","-","-"]
[1105,1110,1670,"-","-","-","-","-","-","-","-","-","-"]
[1110,1115,1740,"-","-","-","-","-","-","-","-","-","-"]
[1115,1120,1810,"-","-","-","-","-","-","-","-","-","-"]
[1120,1125,1880,"-","-","-","-","-","-","-","-","-","-"]
[1125,1130,1950,"-","-","-","-","-","-","-","-","-","-"]
[1130,1135,2020,"-","-","-","-","-","-","-","-","-","-"]
[1135,1140,2090,"-","-","-","-","-","-","-","-","-","-"]
[1140,1145,2160,"-","-","-","-","-","-","-","-","-","-"]
[1145,1150,2230,"-","-","-","-","-","-","-","-","-","-"]
[1150,1155,2300,"-","-","-","-","-","-","-","-","-","-"]
[1155,1160,2370,"-","-","-","-","-","-","-","-","-","-"]
[1160,1165,2440,"-","-","-","-","-","-","-","-","-","-"]
[1165,1170,2500,"-","-","-","-","-","-","-","-","-","-"]
[1170,1175,2570,"-","-","-","-","-","-","-","-","-","-"]
[1175,1180,2640,"-","-","-","-","-","-","-","-","-","-"]
[1180,1185,2710,"-","-","-","-","-","-","-","-","-","-"]
[1185,1190,2780,"-","-","-","-","-","-","-","-","-","-"]
[1190,1195,2850,"-","-","-","-","-","-","-","-","-","-"]
[1195,1200,2920,"-","-","-","-","-","-","-","-","-","-"]
[1200,1205,2990,"-","-","-","-","-","-","-","-","-","-"]
[1205,1210,3060,"-","-","-","-","-","-","-","-","-","-"]
[1210,1215,3130,"-","-","-","-","-","-","-","-","-","-"]
[1215,1220,3200,"-","-","-","-","-","-","-","-","-","-"]
[1220,1225,3270,"-","-","-","-","-","-","-","-","-","-"]
[1225,1230,3340,"-","-","-","-","-","-","-","-","-","-"]
[1230,1235,3410,"-","-","-","-","-","-","-","-","-","-"]
[1235,1240,3480,"-","-","-","-","-","-","-","-","-","-"]
[1240,1245,3550,"-","-","-","-","-","-","-","-","-","-"]
[1245,1250,3620,"-","-","-","-","-","-","-","-","-","-"]
[1250,1255,3700,"-","-","-","-","-","-","-","-","-","-"]
[1255,1260,3810,"-","-","-","-","-","-","-","-","-","-"]
[1260,1265,3910,"-","-","-","-","-","-","-","-","-","-"]
[1265,1270,4010,"-","-","-","-","-","-","-","-","-","-"]
[1270,1275,4120,"-","-","-","-","-","-","-","-","-","-"]
[1275,1280,4220,"-","-","-","-","-","-","-","-","-","-"]
[1280,1285,4320,"-","-","-","-","-","-","-","-","-","-"]
[1285,1290,4430,"-","-","-","-","-","-","-","-","-","-"]
[1290,1295,4530,"-","-","-","-","-","-","-","-","-","-"]
[1295,1300,4630,"-","-","-","-","-","-","-","-","-","-"]
[1300,1305,4740,"-","-","-","-","-","-","-","-","-","-"]
[1305,1310,4840,"-","-","-","-","-","-","-","-","-","-"]
[1310,1315,4940,"-","-","-","-","-","-","-","-","-","-"]
[1315,1320,5050,"-","-","-","-","-","-","-","-","-","-"]
[1320,1325,5150,"-","-","-","-","-","-","-","-","-","-"]
[1325,1330,5250,"-","-","-","-","-","-","-","-","-","-"]
[1330,1335,5360,"-","-","-","-","-","-","-","-","-","-"]
[1335,1340,5460,"-","-","-","-","-","-","-","-","-","-"]
[1340,1345,5560,1060,"-","-","-","-","-","-","-","-","-"]
[1345,1350,5670,1170,"-","-","-","-","-","-","-","-","-"]
[1350,1355,5770,1270,"-","-","-","-","-","-","-","-","-"]
[1355,1360,5870,1370,"-","-","-","-","-","-","-","-","-"]
[1360,1365,5980,1480,"-","-","-","-","-","-","-","-","-"]
[1365,1370,6080,1580,"-","-","-","-","-","-","-","-","-"]
[1370,1375,6180,1680,"-","-","-","-","-","-","-","-","-"]
[1375,1380,6290,1790,"-","-","-","-","-","-","-","-","-"]
[1380,1385,6390,1890,"-","-","-","-","-","-","-","-","-"]
[1385,1390,6490,1990,"-","-","-","-","-","-","-","-","-"]
[1390,1395,6600,2100,"-","-","-","-","-","-","-","-","-"]
[1395,1400,6700,2200,"-","-","-","-","-","-","-","-","-"]
[1400,1405,6800,2300,"-","-","-","-","-","-","-","-","-"]
[1405,1410,6910,2410,"-","-","-","-","-","-","-","-","-"]
[1410,1415,7010,2510,"-","-","-","-","-","-","-","-","-"]
[1415,1420,7110,2610,"-","-","-","-","-","-","-","-","-"]
[1420,1425,7210,2710,"-","-","-","-","-","-","-","-","-"]
[1425,1430,7320,2820,"-","-","-","-","-","-","-","-","-"]
[1430,1435,7420,2920,"-","-","-","-","-","-","-","-","-"]
[1435,1440,7520,3020,"-","-","-","-","-","-","-","-","-"]
[1440,1445,7630,3130,"-","-","-","-","-","-","-","-","-"]
[1445,1450,7730,3230,"-","-","-","-","-","-","-","-","-"]
[1450,1455,7830,3330,"-","-","-","-","-","-","-","-","-"]
[1455,1460,7940,3440,"-","-","-","-","-","-","-","-","-"]
[1460,1465,8040,3540,"-","-","-","-","-","-","-","-","-"]
[1465,1470,8140,3640,"-","-","-","-","-","-","-","-","-"]
[1470,1475,8250,3750,"-","-","-","-","-","-","-","-","-"]
[1475,1480,8350,3850,"-","-","-","-","-","-","-","-","-"]
[1480,1485,8450,3950,"-","-","-","-","-","-","-","-","-"]
[1485,1490,8560,4060,"-","-","-","-","-","-","-","-","-"]
[1490,1495,8660,4160,"-","-","-","-","-","-","-","-","-"]
[1495,1500,8760,4260,"-","-","-","-","-","-","-","-","-"]
[1500,1510,8920,4420,"-","-","-","-","-","-","-","-","-"]
[1510,1520,9120,4620,"-","-","-","-","-","-","-","-","-"]
[1520,1530,9330,4830,"-","-","-","-","-","-","-","-","-"]
[1530,1540,9540,5040,"-","-","-","-","-","-","-","-","-"]
[1540,1550,9740,5240,"-","-","-","-","-","-","-","-","-"]
[1550,1560,9950,5450,"-","-","-","-","-","-","-","-","-"]
[1560,1570,10160,5660,"-","-","-","-","-","-","-","-","-"]
[1570,1580,10360,5860,"-","-","-","-","-","-","-","-","-"]
[1580,1590,10570,6070,"-","-","-","-","-","-","-","-","-"]
[1590,1600,10780,6280,"-","-","-","-","-","-","-","-","-"]
[1600,1610,10980,6480,"-","-","-","-","-","-","-","-","-"]
[1610,1620,11190,6690,"-","-","-","-","-","-","-","-","-"]
[1620,1630,11400,6900,"-","-","-","-","-","-","-","-","-"]
[1630,1640,11600,7100,"-","-","-","-","-","-","-","-","-"]
[1640,1650,11810,7310,"-","-","-","-","-","-","-","-","-"]
[1650,1660,12020,7520,"-","-","-","-","-","-","-","-","-"]
[1660,1670,12220,7720,"-","-","-","-","-","-","-","-","-"]
[1670,1680,12430,7930,"-","-","-","-","-","-","-","-","-"]
[1680,1690,12640,8140,"-","-","-","-","-","-","-","-","-"]
[1690,1700,12840,8340,"-","-","-","-","-","-","-","-","-"]
[1700,1710,13050,8550,"-","-","-","-","-","-","-","-","-"]
[1710,1720,13260,8760,"-","-","-","-","-","-","-","-","-"]
[1720,1730,13460,8960,1040,"-","-","-","-","-","-","-","-"]
[1730,1740,13670,9170,1240,"-","-","-","-","-","-","-","-"]
[1740,1750,13880,9380,1440,"-","-","-","-","-","-","-","-"]
[1750,1760,14080,9580,1640,"-","-","-","-","-","-","-","-"]
[1760,1770,14290,9790,1830,"-","-","-","-","-","-","-","-"]
[1770,1780,14500,10000,2030,"-","-","-","-","-","-","-","-"]
[1780,1790,14700,10200,2230,"-","-","-","-","-","-","-","-"]
[1790,1800,14910,10410,2430,"-","-","-","-","-","-","-","-"]
[1800,1810,15110,10610,2630,"-","-","-","-","-","-","-","-"]
[1810,1820,15320,10820,2830,"-","-","-","-","-","-","-","-"]
[1820,1830,15530,11030,3020,"-","-","-","-","-","-","-","-"]
[1830,1840,15730,11230,3220,"-","-","-","-","-","-","-","-"]
[1840,1850,15940,11440,3420,"-","-","-","-","-","-","-","-"]
[1850,1860,16150,11650,3620,"-","-","-","-","-","-","-","-"]
[1860,1870,16350,11850,3820,"-","-","-","-","-","-","-","-"]
[1870,1880,16560,12060,4020,"-","-","-","-","-","-","-","-"]
[1880,1890,16770,12270,4220,"-","-","-","-","-","-","-","-"]
[1890,1900,16970,12470,4410,1040,"-","-","-","-","-","-","-"]
[1900,1910,17180,12680,4610,1240,"-","-","-","-","-","-","-"]
[1910,1920,17390,12890,4810,1440,"-","-","-","-","-","-","-"]
[1920,1930,17590,13090,5010,1630,"-","-","-","-","-","-","-"]
[1930,1940,17800,13300,5210,1830,"-","-","-","-","-","-","-"]
[1940,1950,18010,13510,5410,2030,"-","-","-","-","-","-","-"]
[1950,1960,18210,13710,5600,2230,"-","-","-","-","-","-","-"]
[1960,1970,18420,13920,5800,2430,"-","-","-","-","-","-","-"]
[1970,1980,18630,14130,6000,2630,"-","-","-","-","-","-","-"]
[1980,1990,18880,14330,6200,2820,"-","-","-","-","-","-","-"]
[1990,2000,19200,14540,6400,3020,"-","-","-","-","-","-","-"]
[2000,2010,19520,14750,6600,3220,"-","-","-","-","-","-","-"]
[2010,2020,19850,14950,6800,3420,"-","-","-","-","-","-","-"]
[2020,2030,20170,15160,6990,3620,"-","-","-","-","-","-","-"]
[2030,2040,20490,15370,7190,3820,"-","-","-","-","-","-","-"]
[2040,2050,20810,15570,7390,4020,"-","-","-","-","-","-","-"]
[2050,2060,21130,15780,7590,4210,"-","-","-","-","-","-","-"]
[2060,2070,21450,15990,7790,4410,1040,"-","-","-","-","-","-"]
[2070,2080,21770,16190,7990,4610,1240,"-","-","-","-","-","-"]
[2080,2090,22090,16400,8180,4810,1430,"-","-","-","-","-","-"]
[2090,2100,22420,16600,8380,5010,1630,"-","-","-","-","-","-"]
[2100,2110,22740,16810,8580,5210,1830,"-","-","-","-","-","-"]
[2110,2120,23060,17020,8780,5400,2030,"-","-","-","-","-","-"]
[2120,2130,23380,17220,8980,5600,2230,"-","-","-","-","-","-"]
[2130,2140,23700,17430,9180,5800,2430,"-","-","-","-","-","-"]
[2140,2150,24020,17640,9380,6000,2630,"-","-","-","-","-","-"]
[2150,2160,24340,17840,9570,6200,2820,"-","-","-","-","-","-"]
[2160,2170,24660,18050,9770,6400,3020,"-","-","-","-","-","-"]
[2170,2180,24990,18260,9970,6600,3220,"-","-","-","-","-","-"]
[2180,2190,25310,18460,10170,6790,3420,"-","-","-","-","-","-"]
[2190,2200,25630,18670,10370,6990,3620,"-","-","-","-","-","-"]
[2200,2210,25950,18950,10570,7190,3820,"-","-","-","-","-","-"]
[2210,2220,26270,19270,10760,7390,4010,"-","-","-","-","-","-"]
[2220,2230,26590,19590,10960,7590,4210,"-","-","-","-","-","-"]
[2230,2240,26910,19910,11160,7790,4410,1040,"-","-","-","-","-"]
[2240,2250,27240,20240,11360,7980,4610,1230,"-","-","-","-","-"]
[2250,2260,27560,20560,11560,8180,4810,1430,"-","-","-","-","-"]
[2260,2270,27880,20880,11760,8380,5010,1630,"-","-","-","-","-"]
[2270,2280,28200,21200,11960,8580,5210,1830,"-","-","-","-","-"]
[2280,2290,28520,21520,12150,8780,5400,2030,"-","-","-","-","-"]
[2290,2300,28840,21840,12350,8980,5600,2230,"-","-","-","-","-"]
[2300,2310,29160,22160,12550,9180,5800,2430,"-","-","-","-","-"]
[2310,2320,29480,22480,12750,9370,6000,2620,"-","-","-","-","-"]
[2320,2330,29810,22810,12950,9570,6200,2820,"-","-","-","-","-"]
[2330,2340,30130,23130,13150,9770,6400,3020,"-","-","-","-","-"]
[2340,2350,30450,23450,13340,9970,6590,3220,"-","-","-","-","-"]
[2350,2360,30770,23770,13540,10170,6790,3420,"-","-","-","-","-"]
[2360,2370,31090,24090,13740,10370,6990,3620,"-","-","-","-","-"]
[2370,2380,31410,24410,13940,10560,7190,3810,"-","-","-","-","-"]
[2380,2390,31970,24730,14140,10760,7390,4010,"-","-","-","-","-"]
[2390,2400,32770,25050,14340,10960,7590,4210,"-","-","-","-","-"]
[2400,2410,33570,25380,14530,11160,7780,4410,1030,"-","-","-","-"]
[2410,2420,34380,25700,14730,11360,7980,4610,1230,"-","-","-","-"]
[2420,2430,35180,26020,14930,11560,8180,4810,1430,"-","-","-","-"]
[2430,2440,35980,26340,15130,11760,8380,5010,1630,"-","-","-","-"]
[2440,2450,36790,26660,15330,11950,8580,5200,1830,"-","-","-","-"]
[2450,2460,37590,26980,15530,12150,8780,5400,2030,"-","-","-","-"]
[2460,2470,38390,27300,15730,12350,8980,5600,2230,"-","-","-","-"]
[2470,2480,39200,27630,15920,12550,9170,5800,2420,"-","-","-","-"]
[2480,2490,40000,27950,16120,12750,9370,6000,2620,"-","-","-","-"]
[2490,2500,40800,28270,16320,12950,9570,6200,2820,"-","-","-","-"]
[2500,2510,41630,28600,16530,13150,9780,6400,3030,"-","-","-","-"]
[2510,2520,42490,28940,16740,13360,9990,6610,3240,"-","-","-","-"]
[2520,2530,43340,29280,16950,13580,10200,6830,3450,"-","-","-","-"]
[2530,2540,44200,29630,17160,13790,10410,7040,3660,"-","-","-","-"]
[2540,2550,45050,29970,17370,14000,10620,7250,3870,"-","-","-","-"]
[2550,2560,45910,30310,17590,14210,10840,7460,4090,"-","-","-","-"]
[2560,2570,46770,30650,17800,14420,11050,7670,4300,"-","-","-","-"]
[2570,2580,47620,31000,18010,14630,11260,7880,4510,1130,"-","-","-"]
[2580,2590,48480,31340,18220,14850,11470,8100,4720,1350,"-","-","-"]
[2590,2600,49330,31830,18430,15060,11680,8310,4930,1560,"-","-","-"]
[2600,2610,50190,32690,18650,15270,11900,8520,5150,1770,"-","-","-"]
[2610,2620,51040,33540,18920,15480,12110,8730,5360,1980,"-","-","-"]
[2620,2630,51900,34400,19250,15690,12320,8940,5570,2190,"-","-","-"]
[2630,2640,52760,35260,19580,15910,12530,9160,5780,2410,"-","-","-"]
[2640,2650,53610,36110,19910,16120,12740,9370,5990,2620,"-","-","-"]
[2650,2660,54470,36970,20240,16330,12960,9580,6210,2830,"-","-","-"]
[2660,2670,55320,37820,20570,16540,13170,9790,6420,3040,"-","-","-"]
[2670,2680,56180,38680,20900,16750,13380,10000,6630,3250,"-","-","-"]
[2680,2690,57040,39540,21230,16970,13590,10220,6840,3470,"-","-","-"]
[2690,2700,57890,40390,21560,17180,13800,10430,7050,3680,"-","-","-"]
[2700,2710,58750,41250,21890,17390,14020,10640,7270,3890,"-","-","-"]
[2710,2720,59600,42100,22220,17600,14230,10850,7480,4100,"-","-","-"]
[2720,2730,60460,42960,22550,17810,14440,11060,7690,4310,"-","-","-"]
[2730,2740,61310,43810,22880,18030,14650,11280,7900,4530,1150,"-","-"]
[2740,2750,62170,44670,23210,18240,14860,11490,8110,4740,1360,"-","-"]
[2750,2760,63030,45530,23540,18450,15070,11700,8320,4950,1570,"-","-"]
[2760,2770,63880,46380,23870,18660,15290,11910,8540,5160,1790,"-","-"]
[2770,2780,64740,47240,24200,18950,15500,12120,8750,5370,2000,"-","-"]
[2780,2790,65590,48090,24520,19270,15710,12340,8960,5590,2210,"-","-"]
[2790,2800,66450,48950,24850,19600,15920,12550,9170,5800,2420,"-","-"]
[2800,2810,67300,49800,25180,19930,16130,12760,9380,6010,2630,"-","-"]
[2810,2820,68160,50660,25510,20260,16350,12970,9600,6220,2850,"-","-"]
[2820,2830,69020,51520,25840,20590,16560,13180,9810,6430,3060,"-","-"]
[2830,2840,69870,52370,26170,20920,16770,13400,10020,6650,3270,"-","-"]
[2840,2850,70730,53230,26500,21250,16980,13610,10230,6860,3480,"-","-"]
[2850,2860,71580,54080,26830,21580,17190,13820,10440,7070,3690,"-","-"]
[2860,2870,72440,54940,27160,21910,17410,14030,10660,7280,3910,"-","-"]
[2870,2880,73290,55790,27490,22240,17620,14240,10870,7490,4120,"-","-"]
[2880,2890,74150,56650,27820,22570,17830,14460,11080,7710,4330,"-","-"]
[2890,2900,75010,57510,28150,22900,18040,14670,11290,7920,4540,1170,"-"]
[2900,2910,75860,58360,28480,23230,18250,14880,11500,8130,4750,1380,"-"]
[2910,2920,76720,59220,28810,23560,18470,15090,11720,8340,4970,1590,"-"]
[2920,2930,77570,60070,29140,23890,18680,15300,11930,8550,5180,1800,"-"]
[2930,2940,78430,60930,29470,24220,18970,15510,12140,8760,5390,2010,"-"]
[2940,2950,79280,61780,29800,24550,19300,15730,12350,8980,5600,2230,"-"]
[2950,2960,80140,62640,30130,24880,19630,15940,12560,9190,5810,2440,"-"]
[2960,2970,81000,63500,30460,25210,19960,16150,12780,9400,6030,2650,"-"]
[2970,2980,81850,64350,30790,25540,20290,16360,12990,9610,6240,2860,"-"]
[2980,2990,82710,65210,31120,25870,20620,16570,13200,9820,6450,3070,"-"]
[2990,3000,83560,66060,31450,26200,20950,16790,13410,10040,6660,3290,"-"]
[3000,3020,84850,67350,32490,26690,21440,17100,13730,10350,6980,3600,"-"]
[3020,3040,86560,69060,34140,27350,22100,17530,14150,10780,7400,4030,"-"]
[3040,3060,88270,70770,35790,28010,22760,17950,14580,11200,7830,4450,1080]
[3060,3080,89980,72480,37440,28670,23420,18380,15000,11630,8250,4880,1500]
[3080,3100,91690,74190,39080,29330,24080,18830,15430,12050,8680,5300,1930]
[3100,3120,93400,75900,40730,29990,24740,19490,15850,12470,9100,5720,2350]
[3120,3140,95760,77620,42380,30650,25400,20150,16270,12900,9520,6150,2770]
[3140,3160,98210,79330,44030,31310,26060,20810,16700,13320,9950,6570,3200]
[3160,3180,100650,81040,45680,32550,26720,21470,17120,13750,10370,7000,3620]
[3180,3200,103100,82750,47330,34200,27380,22130,17540,14170,10790,7420,4040]
[3200,3220,105540,84460,48980,35850,28040,22790,17970,14590,11220,7840,4470]
[3220,3240,107990,86170,50620,37500,28700,23450,18390,15020,11640,8270,4890]
[3240,3260,110430,87880,52270,39150,29360,24110,18860,15440,12070,8690,5320]
[3260,3280,112880,89600,53920,40800,30020,24770,19520,15870,12490,9120,5740]
[3280,3300,115320,91310,55570,42440,30670,25420,20170,16290,12910,9540,6160]
[3300,3320,117770,93020,57220,44090,31330,26080,20830,16710,13340,9960,6590]
[3320,3340,120210,95210,58870,45740,32620,26740,21490,17140,13760,10390,7010]
[3340,3360,122660,97660,60440,47320,34190,27370,22120,17540,14170,10790,7420]
[3360,3380,125100,100100,62010,48880,35760,28000,22750,17950,14570,11200,7820]
[3380,3400,127550,102550,63570,50450,37320,28630,23380,18350,14970,11600,8220]
[3400,3420,129990,104990,65140,52010,38890,29250,24000,18750,15370,12000,8620]
[3420,3440,132440,107440,66700,53580,40450,29880,24630,19380,15780,12400,9030]
[3440,3460,134880,109880,68270,55140,42020,30500,25250,20000,16180,12800,9430]
[3460,3480,137330,112330,69830,56710,43580,31130,25880,20630,16580,13210,9830]
[3480,3500,139770,114770,71400,58270,45150,32020,26510,21260,16980,13610,10230]
[3500,3520,142220,117220,72960,59840,46710,33590,27130,21880,17390,14010,10640]
[3520,3540,144660,119660,74530,61400,48280,35150,27760,22510,17790,14410,11040]
[3540,3560,147110,122110,76090,62960,49840,36710,28380,23130,18190,14820,11440]
[3560,3580,149550,124550,77650,64530,51400,38280,29010,23760,18590,15220,11840]
[3580,3600,152000,127000,79220,66090,52970,39840,29630,24380,19130,15620,12250]
[3600,3620,154440,129440,80780,67660,54530,41410,30260,25010,19760,16020,12650]
[3620,3640,156890,131890,82350,69220,56100,42970,30890,25640,20390,16420,13050]
[3640,3660,159330,134330,83910,70790,57660,44540,31510,26260,21010,16830,13450]
[3660,3680,161780,136780,85480,72350,59230,46100,32980,26890,21640,17230,13850]
[3680,3700,164220,139220,87040,73920,60790,47670,34540,27510,22260,17630,14260]
[3700,3720,166670,141670,88610,75480,62360,49230,36110,28140,22890,18030,14660]
[3720,3740,169110,144110,90170,77050,63920,50800,37670,28770,23520,18440,15060]
[3740,3760,171560,146560,91730,78610,65480,52360,39230,29390,24140,18890,15460]
[3760,3780,178920,151090,95250,81630,68510,55380,42260,30600,25350,20100,16240]
[3780,3800,181590,153740,97700,83350,70220,57100,43970,31290,26040,20790,16680]
[3800,3820,184260,156400,100140,85060,71930,58810,45680,32560,26720,21470,17120]
[3820,3840,186930,159050,102590,86770,73640,60520,47390,34270,27400,22150,17560]
[3840,3860,189600,161710,105030,88480,75350,62230,49100,35980,28090,22840,18000]
[3860,3880,192270,164360,107480,90190,77070,63940,50820,37690,28770,23520,18440]
[3880,3900,194940,167020,109920,91900,78780,65650,52530,39400,29460,24210,18960]
[3900,3920,197610,169670,112370,93620,80490,67360,54240,41110,30140,24890,19640]
[3920,3940,200280,172330,114810,96060,82200,69080,55950,42830,30830,25580,20330]
[3940,3960,202950,174980,117260,98510,83910,70790,57660,44540,31510,26260,21010]
[3960,3980,205620,177640,119700,100950,85620,72500,59370,46250,33120,26950,21700]
[3980,4000,208290,180290,122150,103400,87340,74210,61090,47960,34840,27630,22380]
[4000,4020,210960,182950,124590,105840,89050,75920,62800,49670,36550,28320,23070]
[4020,4040,213630,185600,127040,108290,90760,77630,64510,51380,38260,29000,23750]
[4040,4060,216300,188260,129480,110730,92470,79340,66220,53090,39970,29680,24430]
[4060,4080,218970,190910,131930,113180,94430,81060,67930,54810,41680,30370,25120]
[4080,4100,221640,193570,134370,115620,96870,82770,69640,56520,43390,31050,25800]
[4100,4120,224310,196220,136820,118070,99320,84480,71350,58230,45100,31980,26490]
[4120,4140,226980,198880,139260,120510,101760,86190,73070,59940,46820,33690,27170]
[4140,4160,229650,201530,141710,122960,104210,87900,74780,61650,48530,35400,27860]
[4160,4180,232320,204190,144150,125400,106650,89610,76490,63360,50240,37110,28540]
[4180,4200,234990,206840,146600,127850,109100,91330,78200,65080,51950,38830,29230]
[4200,4220,237660,209500,149040,130290,111540,93040,79910,66790,53660,40540,29910]
[4220,4240,240330,212150,151490,132740,113990,95240,81620,68500,55370,42250,30600]
[4240,4260,243000,214810,153930,135180,116430,97680,83330,70210,57080,43960,31280]
[4260,4280,245670,217460,156380,137630,118880,100130,85050,71920,58800,45670,32550]
[4280,4300,248340,220120,158820,140070,121320,102570,86760,73630,60510,47380,34260]
[4300,4320,251010,222770,161270,142520,123770,105020,88470,75340,62220,49090,35970]
[4320,4340,253680,225430,163710,144960,126210,107460,90180,77060,63930,50810,37680]
[4340,4360,256350,228080,166160,147410,128660,109910,91890,78770,65640,52520,39390]
[4360,4380,259020,230740,168600,149850,131100,112350,93600,80480,67350,54230,41100]
[4380,4400,261690,233390,171050,152300,133550,114800,96050,82190,69070,55940,42820]
[4400,4420,264360,236050,173490,154740,135990,117240,98490,83900,70780,57650,44530]
[4420,4440,267030,238700,175940,157190,138440,119690,100940,85610,72490,59360,46240]
[4440,4460,269700,241360,178380,159630,140880,122130,103380,87320,74200,61070,47950]
[4460,4480,272370,244010,180830,162080,143330,124580,105830,89040,75910,62790,49660]
[4480,4500,275040,246670,183270,164520,145770,127020,108270,90750,77620,64500,51370]
[4500,4520,277840,249460,185850,167100,148350,129600,110850,92550,79430,66300,53180]
[4520,4540,280650,252250,188430,169680,150930,132180,113430,94680,81230,68110,54980]
[4540,4560,283450,255040,191010,172260,153510,134760,116010,97260,83040,69920,56790]
[4560,4580,286260,257830,193590,174840,156090,137340,118590,99840,84850,71720,58600]
[4580,4600,291560,263120,198670,179920,161170,142420,123670,104920,86650,73530,60400]
[4600,4620,294370,265910,201250,182500,163750,145000,126250,107500,88750,75330,62210]
[4620,4640,297170,268700,203830,185080,166330,147580,128830,110080,91330,77140,64010]
[4640,4660,299980,271490,206410,187660,168910,150160,131410,112660,93910,78950,65820]
[4660,4680,302780,274280,208990,190240,171490,152740,133990,115240,96490,80750,67630]
[4680,4700,305590,277070,211570,192820,174070,155320,136570,117820,99070,82560,69430]
[4700,4720,308390,279860,214150,195400,176650,157900,139150,120400,101650,84360,71240]
[4720,4740,311200,282650,216730,197980,179230,160480,141730,122980,104230,86170,73040]
[4740,4760,314000,285440,219310,200560,181810,163060,144310,125560,106810,88060,74850]
[4760,4780,316810,288230,221890,203140,184390,165640,146890,128140,109390,90640,76660]
[4780,4800,319610,291020,224470,205720,186970,168220,149470,130720,111970,93220,78460]
[4800,4820,322420,293810,227050,208300,189550,170800,152050,133300,114550,95800,80270]
[4820,4840,325220,296600,229630,210880,192130,173380,154630,135880,117130,98380,82070]
[4840,4860,328030,299390,232210,213460,194710,175960,157210,138460,119710,100960,83880]
[4860,4880,330830,302180,234790,216040,197290,178540,159790,141040,122290,103540,85690]
[4880,4900,333640,304970,237370,218620,199870,181120,162370,143620,124870,106120,87490]
[4900,4920,336440,307760,239950,221200,202450,183700,164950,146200,127450,108700,89950]
[4920,4940,339250,310550,242530,223780,205030,186280,167530,148780,130030,111280,92530]
[4940,4960,342050,313340,245110,226360,207610,188860,170110,151360,132610,113860,95110]
[4960,4980,344860,316130,247690,228940,210190,191440,172690,153940,135190,116440,97690]
[4980,5000,347660,318920,250270,231520,212770,194020,175270,156520,137770,119020,100270]
[5000,5020,350470,321710,252850,234100,215350,196600,177850,159100,140350,121600,102850]
[5020,5040,353270,324500,255430,236680,217930,199180,180430,161680,142930,124180,105430]
[5040,5060,356080,327290,258010,239260,220510,201760,183010,164260,145510,126760,108010]
[5060,5080,358880,330080,260590,241840,223090,204340,185590,166840,148090,129340,110590]
[5080,5100,361690,332870,263170,244420,225670,206920,188170,169420,150670,131920,113170]
[5100,5120,364490,335660,265750,247000,228250,209500,190750,172000,153250,134500,115750]
[5120,5140,367300,338450,268330,249580,230830,212080,193330,174580,155830,137080,118330]
[5140,5160,370100,341240,270910,252160,233410,214660,195910,177160,158410,139660,120910]
[5160,5180,372910,344030,273490,254740,235990,217240,198490,179740,160990,142240,123490]
[5180,5200,375710,346820,276070,257320,238570,219820,201070,182320,163570,144820,126070]
[5200,5220,378520,349610,278650,259900,241150,222400,203650,184900,166150,147400,128650]
[5220,5240,381320,352400,281230,262480,243730,224980,206230,187480,168730,149980,131230]
[5240,5260,384130,355190,283810,265060,246310,227560,208810,190060,171310,152560,133810]
[5260,5280,386930,357980,286390,267640,248890,230140,211390,192640,173890,155140,136390]
[5280,5300,389740,360770,288970,270220,251470,232720,213970,195220,176470,157720,138970]
[5300,5320,392540,363560,291550,272800,254050,235300,216550,197800,179050,160300,141550]
[5320,5340,395350,366350,294130,275380,256630,237880,219130,200380,181630,162880,144130]
[5340,5360,398150,369140,296710,277960,259210,240460,221710,202960,184210,165460,146710]
[5360,5380,400960,371930,299290,280540,261790,243040,224290,205540,186790,168040,149290]
[5380,5400,403760,374720,301870,283120,264370,245620,226870,208120,189370,170620,151870]
[5400,5420,406570,377510,304450,285700,266950,248200,229450,210700,191950,173200,154450]
[5420,5440,409370,380300,307030,288280,269530,250780,232030,213280,194530,175780,157030]
[5440,5460,412180,383090,309610,290860,272110,253360,234610,215860,197110,178360,159610]
[5460,5480,414980,385880,312190,293440,274690,255940,237190,218440,199690,180940,162190]
[5480,5500,417790,388670,314770,296020,277270,258520,239770,221020,202270,183520,164770]
[5500,5520,420590,391460,317350,298600,279850,261100,242350,223600,204850,186100,167350]
[5520,5540,423400,394250,319930,301180,282430,263680,244930,226180,207430,188680,169930]
[5540,5560,426200,397040,322510,303760,285010,266260,247510,228760,210010,191260,172510]
[5560,5580,429010,399830,325090,306340,287590,268840,250090,231340,212590,193840,175090]
[5580,5600,431810,402620,327670,308920,290170,271420,252670,233920,215170,196420,177670]
[5600,5620,435890,405410,330250,311500,292750,274000,255250,236500,217750,199000,180250]
[5620,5640,440380,408200,332830,314080,295330,276580,257830,239080,220330,201580,182830]
[5640,5660,444860,410990,335410,316660,297910,279160,260410,241660,222910,204160,185410]
[5660,5680,449350,413780,337990,319240,300490,281740,262990,244240,225490,206740,187990]
[5680,5700,453840,416570,340570,321820,303070,284320,265570,246820,228070,209320,190570]
[5700,5720,458330,419360,343150,324400,305650,286900,268150,249400,230650,211900,193150]
[5720,5740,462820,422150,345730,326980,308230,289480,270730,251980,233230,214480,195730]
[5740,5760,467300,424940,348310,329560,310810,292060,273310,254560,235810,217060,198310]
[5760,5780,471790,427730,350890,332140,313390,294640,275890,257140,238390,219640,200890]
[5780,5800,476280,430520,353470,334720,315970,297220,278470,259720,240970,222220,203470]
[5800,5820,480770,433800,356050,337300,318550,299800,281050,262300,243550,224800,206050]
[5820,5840,485260,438260,358630,339880,321130,302380,283630,264880,246130,227380,208630]
[5840,5860,512120,465100,387100,368350,349600,330850,312100,293350,274600,255850,237100]
[5860,5880,519150,472110,392240,373490,354740,335990,317240,298490,279740,260990,242240]
[5880,5900,523690,476620,394880,376130,357380,338630,319880,301130,282380,263630,244880]
[5900,5920,528220,481130,397520,378770,360020,341270,322520,303770,285020,266270,247520]
[5920,5940,532760,485640,400160,381410,362660,343910,325160,306410,287660,268910,250160]
[5940,5960,537300,490160,402800,384050,365300,346550,327800,309050,290300,271550,252800]
[5960,5980,541830,494670,405440,386690,367940,349190,330440,311690,292940,274190,255440]
[5980,6000,546370,499180,408080,389330,370580,351830,333080,314330,295580,276830,258080]
[6000,6020,550900,503690,410720,391970,373220,354470,335720,316970,298220,279470,260720]
[6020,6040,555440,508200,413360,394610,375860,357110,338360,319610,300860,282110,263360]
[6040,6060,559980,512720,416000,397250,378500,359750,341000,322250,303500,284750,266000]
[6060,6080,564510,517230,418640,399890,381140,362390,343640,324890,306140,287390,268640]
[6080,6100,569050,521740,421280,402530,383780,365030,346280,327530,308780,290030,271280]
[6100,6120,573580,526250,423920,405170,386420,367670,348920,330170,311420,292670,273920]
[6120,6140,578120,530760,426560,407810,389060,370310,351560,332810,314060,295310,276560]
[6140,6160,582660,535280,429200,410450,391700,372950,354200,335450,316700,297950,279200]
[6160,6180,587190,539790,431840,413090,394340,375590,356840,338090,319340,300590,281840]
[6180,6200,591730,544300,434480,415730,396980,378230,359480,340730,321980,303230,284480]
[6200,6220,596260,548810,437120,418370,399620,380870,362120,343370,324620,305870,287120]
[6220,6240,600800,553320,439760,421010,402260,383510,364760,346010,327260,308510,289760]
[6240,6260,605340,557840,442400,423650,404900,386150,367400,348650,329900,311150,292400]
[6260,6280,609870,562350,446060,426290,407540,388790,370040,351290,332540,313790,295040]
[6280,6300,614410,566860,450280,428930,410180,391430,372680,353930,335180,316430,297680]
[6300,6320,618940,571370,454510,431570,412820,394070,375320,356570,337820,319070,300320]
[6320,6340,623480,575880,458730,434210,415460,396710,377960,359210,340460,321710,302960]
[6340,6360,628020,580400,462960,436850,418100,399350,380600,361850,343100,324350,305600]
[6360,6380,632550,584910,467180,439490,420740,401990,383240,364490,345740,326990,308240]
[6380,6400,637090,589420,471400,442130,423380,404630,385880,367130,348380,329630,310880]
[6400,6420,641620,593930,475630,445630,426020,407270,388520,369770,351020,332270,313520]
[6420,6440,646160,598440,479850,449850,428660,409910,391160,372410,353660,334910,316160]
[6440,6460,650700,602960,484080,454080,431300,412550,393800,375050,356300,337550,318800]
[6460,6480,655230,607470,488300,458300,433940,415190,396440,377690,358940,340190,321440]
[6480,6500,659770,611980,492520,462520,436580,417830,399080,380330,361580,342830,324080]
[6500,6520,664300,616490,496750,466750,439220,420470,401720,382970,364220,345470,326720]
[6520,6540,668840,621000,500970,470970,441860,423110,404360,385610,366860,348110,329360]
[6540,6560,673380,625520,505200,475200,445200,425750,407000,388250,369500,350750,332000]
[6560,6580,677910,630030,509420,479420,449420,428390,409640,390890,372140,353390,334640]
[6580,6600,682450,634540,513640,483640,453640,431030,412280,393530,374780,356030,337280]
[6600,6620,686980,639050,517870,487870,457870,433670,414920,396170,377420,358670,339920]
[6620,6640,691520,643560,522090,492090,462090,436310,417560,398810,380060,361310,342560]
[6640,6660,696060,648080,526320,496320,466320,438950,420200,401450,382700,363950,345200]
[6660,6680,700590,652590,530540,500540,470540,441590,422840,404090,385340,366590,347840]
[6680,6700,705130,657100,534760,504760,474760,444760,425480,406730,387980,369230,350480]
[6700,6720,709660,661610,538990,508990,478990,448990,428120,409370,390620,371870,353120]
[6720,6740,714200,666120,543210,513210,483210,453210,430760,412010,393260,374510,355760]
[6740,6760,718740,670640,547440,517440,487440,457440,433400,414650,395900,377150,358400]
[6760,6780,723270,675150,551660,521660,491660,461660,436040,417290,398540,379790,361040]
[6780,6800,727810,679660,555880,525880,495880,465880,438680,419930,401180,382430,363680]
[6800,6820,732340,684170,560110,530110,500110,470110,441320,422570,403820,385070,366320]
[6820,6840,736880,688680,564330,534330,504330,474330,444330,425210,406460,387710,368960]
[6840,6860,741420,693200,568560,538560,508560,478560,448560,427850,409100,390350,371600]
[6860,6880,745950,697710,572780,542780,512780,482780,452780,430490,411740,392990,374240]
[6880,6900,750490,702220,577000,547000,517000,487000,457000,433130,414380,395630,376880]
[6900,6920,755020,706730,581230,551230,521230,491230,461230,435770,417020,398270,379520]
[6920,6940,759560,711240,585450,555450,525450,495450,465450,438410,419660,400910,382160]
[6940,6960,764100,715760,589680,559680,529680,499680,469680,441050,422300,403550,384800]
[6960,6980,768630,720270,593900,563900,533900,503900,473900,443900,424940,406190,387440]
[6980,7000,773170,724780,598120,568120,538120,508120,478120,448120,427580,408830,390080]
[7000,7020,777700,729290,602350,572350,542350,512350,482350,452350,430220,411470,392720]
[7020,7040,782240,733800,606570,576570,546570,516570,486570,456570,432860,414110,395360]
[7040,7060,786780,738320,610800,580800,550800,520800,490800,460800,435500,416750,398000]
[7060,7080,791310,742830,615020,585020,555020,525020,495020,465020,438140,419390,400640]
[7080,7100,795850,747340,619240,589240,559240,529240,499240,469240,440780,422030,403280]
[7100,7120,800380,751850,623470,593470,563470,533470,503470,473470,443470,424670,405920]
[7120,7140,804920,756360,627690,597690,567690,537690,507690,477690,447690,427310,408560]
[7140,7160,809460,760880,631920,601920,571920,541920,511920,481920,451920,429950,411200]
[7160,7180,813990,765390,636140,606140,576140,546140,516140,486140,456140,432590,413840]
[7180,7200,818530,769900,640360,610360,580360,550360,520360,490360,460360,435230,416480]
[7200,7220,823060,774410,644590,614590,584590,554590,524590,494590,464590,437870,419120]
[7220,7240,827600,778920,648810,618810,588810,558810,528810,498810,468810,440510,421760]
[7240,7260,832140,783440,653040,623040,593040,563040,533040,503040,473040,443150,424400]
[7260,7280,836670,787950,657260,627260,597260,567260,537260,507260,477260,447260,427040]
[7280,7300,841210,792460,661480,631480,601480,571480,541480,511480,481480,451480,429680]
[7300,7320,845740,796970,665710,635710,605710,575710,545710,515710,485710,455710,432320]
[7320,7340,850280,801480,669930,639930,609930,579930,549930,519930,489930,459930,434960]
[7340,7360,854820,806000,674160,644160,614160,584160,554160,524160,494160,464160,437600]
[7360,7380,859350,810510,678380,648380,618380,588380,558380,528380,498380,468380,440240]
[7380,7400,863890,815020,682600,652600,622600,592600,562600,532600,502600,472600,442880]
[7400,7420,868420,819530,686830,656830,626830,596830,566830,536830,506830,476830,446830]
[7420,7440,872960,824040,691050,661050,631050,601050,571050,541050,511050,481050,451050]
[7440,7460,877500,828560,695280,665280,635280,605280,575280,545280,515280,485280,455280]
[7460,7480,882030,833070,699500,669500,639500,609500,579500,549500,519500,489500,459500]
[7480,7500,886570,837580,703720,673720,643720,613720,583720,553720,523720,493720,463720]
[7500,7520,891100,842090,707950,677950,647950,617950,587950,557950,527950,497950,467950]
[7520,7540,895640,846600,712170,682170,652170,622170,592170,562170,532170,502170,472170]
[7540,7560,900180,851120,716400,686400,656400,626400,596400,566400,536400,506400,476400]
[7560,7580,904710,855630,720620,690620,660620,630620,600620,570620,540620,510620,480620]
[7580,7600,909250,860140,724840,694840,664840,634840,604840,574840,544840,514840,484840]
[7600,7620,913780,864650,729070,699070,669070,639070,609070,579070,549070,519070,489070]
[7620,7640,918320,869160,733290,703290,673290,643290,613290,583290,553290,523290,493290]
[7640,7660,922860,873680,737520,707520,677520,647520,617520,587520,557520,527520,497520]
[7660,7680,927390,878190,741740,711740,681740,651740,621740,591740,561740,531740,501740]
[7680,7700,931930,882700,745960,715960,685960,655960,625960,595960,565960,535960,505960]
[7700,7720,936460,887210,750190,720190,690190,660190,630190,600190,570190,540190,510190]
[7720,7740,941000,891720,754410,724410,694410,664410,634410,604410,574410,544410,514410]
[7740,7760,945540,896240,758640,728640,698640,668640,638640,608640,578640,548640,518640]
[7760,7780,950070,900750,762860,732860,702860,672860,642860,612860,582860,552860,522860]
[7780,7800,954610,905260,767080,737080,707080,677080,647080,617080,587080,557080,527080]
[7800,7820,959140,909770,771310,741310,711310,681310,651310,621310,591310,561310,531310]
[7820,7840,963680,914280,775530,745530,715530,685530,655530,625530,595530,565530,535530]
[7840,7860,968220,918800,779760,749760,719760,689760,659760,629760,599760,569760,539760]
[7860,7880,972750,923310,783980,753980,723980,693980,663980,633980,603980,573980,543980]
[7880,7900,977290,927820,788200,758200,728200,698200,668200,638200,608200,578200,548200]
[7900,7920,981820,932330,792430,762430,732430,702430,672430,642430,612430,582430,552430]
[7920,7940,986360,936840,796650,766650,736650,706650,676650,646650,616650,586650,556650]
[7940,7960,990900,941360,800880,770880,740880,710880,680880,650880,620880,590880,560880]
[7960,7980,995430,945870,805100,775100,745100,715100,685100,655100,625100,595100,565100]
[7980,8000,999970,950380,809320,779320,749320,719320,689320,659320,629320,599320,569320]
[8000,8020,1004500,954890,813550,783550,753550,723550,693550,663550,633550,603550,573550]
[8020,8040,1009040,959400,817770,787770,757770,727770,697770,667770,637770,607770,577770]
[8040,8060,1013580,963920,822000,792000,762000,732000,702000,672000,642000,612000,582000]
[8060,8080,1018110,968430,826220,796220,766220,736220,706220,676220,646220,616220,586220]
[8080,8100,1022650,972940,830440,800440,770440,740440,710440,680440,650440,620440,590440]
[8100,8120,1027180,977450,834670,804670,774670,744670,714670,684670,654670,624670,594670]
[8120,8140,1031720,981960,838890,808890,778890,748890,718890,688890,658890,628890,598890]
[8140,8160,1036260,986480,843120,813120,783120,753120,723120,693120,663120,633120,603120]
[8160,8180,1040790,990990,847340,817340,787340,757340,727340,697340,667340,637340,607340]
[8180,8200,1045330,995500,851560,821560,791560,761560,731560,701560,671560,641560,611560]
[8200,8220,1049860,1000010,855790,825790,795790,765790,735790,705790,675790,645790,615790]
[8220,8240,1054400,1004520,860010,830010,800010,770010,740010,710010,680010,650010,620010]
[8240,8260,1058940,1009040,864240,834240,804240,774240,744240,714240,684240,654240,624240]
[8260,8280,1063470,1013550,868460,838460,808460,778460,748460,718460,688460,658460,628460]
[8280,8300,1068010,1018060,872680,842680,812680,782680,752680,722680,692680,662680,632680]
[8300,8320,1072540,1022570,876910,846910,816910,786910,756910,726910,696910,666910,636910]
[8320,8340,1077080,1027080,881130,851130,821130,791130,761130,731130,701130,671130,641130]
[8340,8360,1081740,1031720,885480,855480,825480,795480,765480,735480,705480,675480,645480]
[8360,8380,1086420,1036370,889840,859840,829840,799840,769840,739840,709840,679840,649840]
[8380,8400,1091100,1041030,894210,864210,834210,804210,774210,744210,714210,684210,654210]
[8400,8420,1095780,1045680,898580,868580,838580,808580,778580,748580,718580,688580,658580]
[8420,8440,1100460,1050340,902950,872950,842950,812950,782950,752950,722950,692950,662950]
[8440,8460,1105140,1055000,907320,877320,847320,817320,787320,757320,727320,697320,667320]
[8460,8480,1109820,1059650,911680,881680,851680,821680,791680,761680,731680,701680,671680]
[8480,8500,1114500,1064310,916050,886050,856050,826050,796050,766050,736050,706050,676050]
[8500,8520,1119180,1068960,920420,890420,860420,830420,800420,770420,740420,710420,680420]
[8520,8540,1123860,1073620,924790,894790,864790,834790,804790,774790,744790,714790,684790]
[8540,8560,1128540,1078280,929160,899160,869160,839160,809160,779160,749160,719160,689160]
[8560,8580,1133220,1082930,933520,903520,873520,843520,813520,783520,753520,723520,693520]
[8580,8600,1137900,1087590,937890,907890,877890,847890,817890,787890,757890,727890,697890]
[8600,8620,1142580,1092240,942260,912260,882260,852260,822260,792260,762260,732260,702260]
[8620,8640,1147260,1096900,946630,916630,886630,856630,826630,796630,766630,736630,706630]
[8640,8660,1151940,1101560,951000,921000,891000,861000,831000,801000,771000,741000,711000]
[8660,8680,1156620,1106210,955360,925360,895360,865360,835360,805360,775360,745360,715360]
[8680,8700,1161300,1110870,959730,929730,899730,869730,839730,809730,779730,749730,719730]
[8700,8720,1165980,1115520,964100,934100,904100,874100,844100,814100,784100,754100,724100]
[8720,8740,1170660,1120180,968470,938470,908470,878470,848470,818470,788470,758470,728470]
[8740,8760,1175340,1124840,972840,942840,912840,882840,852840,822840,792840,762840,732840]
[8760,8780,1180020,1129490,977200,947200,917200,887200,857200,827200,797200,767200,737200]
[8780,8800,1184700,1134150,981570,951570,921570,891570,861570,831570,801570,771570,741570]
[8800,8820,1189380,1138800,985940,955940,925940,895940,865940,835940,805940,775940,745940]
[8820,8840,1194060,1143460,990310,960310,930310,900310,870310,840310,810310,780310,750310]
[8840,8860,1198740,1148120,994680,964680,934680,904680,874680,844680,814680,784680,754680]
[8860,8880,1203420,1152770,999040,969040,939040,909040,879040,849040,819040,789040,759040]
[8880,8900,1208100,1157430,1003410,973410,943410,913410,883410,853410,823410,793410,763410]
[8900,8920,1212780,1162080,1007780,977780,947780,917780,887780,857780,827780,797780,767780]
[8920,8940,1217460,1166740,1012150,982150,952150,922150,892150,862150,832150,802150,772150]
[8940,8960,1222140,1171400,1016520,986520,956520,926520,896520,866520,836520,806520,776520]
[8960,8980,1226820,1176050,1020880,990880,960880,930880,900880,870880,840880,810880,780880]
[8980,9000,1231500,1180710,1025250,995250,965250,935250,905250,875250,845250,815250,785250]
[9000,9020,1236180,1185360,1029620,999620,969620,939620,909620,879620,849620,819620,789620]
[9020,9040,1240860,1190020,1033990,1003990,973990,943990,913990,883990,853990,823990,793990]
[9040,9060,1245540,1194680,1038360,1008360,978360,948360,918360,888360,858360,828360,798360]
[9060,9080,1250220,1199330,1042720,1012720,982720,952720,922720,892720,862720,832720,802720]
[9080,9100,1254900,1203990,1047090,1017090,987090,957090,927090,897090,867090,837090,807090]
[9100,9120,1259580,1208640,1051460,1021460,991460,961460,931460,901460,871460,841460,811460]
[9120,9140,1264260,1213300,1055830,1025830,995830,965830,935830,905830,875830,845830,815830]
[9140,9160,1268940,1217960,1060200,1030200,1000200,970200,940200,910200,880200,850200,820200]
[9160,9180,1273620,1222610,1064560,1034560,1004560,974560,944560,914560,884560,854560,824560]
[9180,9200,1278300,1227270,1068930,1038930,1008930,978930,948930,918930,888930,858930,828930]
[9200,9220,1282980,1231920,1073300,1043300,1013300,983300,953300,923300,893300,863300,833300]
[9220,9240,1289640,1236580,1077670,1047670,1017670,987670,957670,927670,897670,867670,837670]
[9240,9260,1296470,1241240,1082040,1052040,1022040,992040,962040,932040,902040,872040,842040]
[9260,9280,1303290,1245890,1086400,1056400,1026400,996400,966400,936400,906400,876400,846400]
[9280,9300,1310120,1250550,1090770,1060770,1030770,1000770,970770,940770,910770,880770,850770]
[9300,9320,1316940,1255200,1095140,1065140,1035140,1005140,975140,945140,915140,885140,855140]
[9320,9340,1323770,1259860,1099510,1069510,1039510,1009510,979510,949510,919510,889510,859510]
[9340,9360,1330590,1264520,1103880,1073880,1043880,1013880,983880,953880,923880,893880,863880]
[9360,9380,1337420,1269170,1108240,1078240,1048240,1018240,988240,958240,928240,898240,868240]
[9380,9400,1344240,1273830,1112610,1082610,1052610,1022610,992610,962610,932610,902610,872610]
[9400,9420,1351070,1278480,1116980,1086980,1056980,1026980,996980,966980,936980,906980,876980]
[9420,9440,1357890,1283140,1121350,1091350,1061350,1031350,1001350,971350,941350,911350,881350]
[9440,9460,1364720,1289840,1125720,1095720,1065720,1035720,1005720,975720,945720,915720,885720]
[9460,9480,1371540,1296630,1130080,1100080,1070080,1040080,1010080,980080,950080,920080,890080]
[9480,9500,1378370,1303420,1134450,1104450,1074450,1044450,1014450,984450,954450,924450,894450]
[9500,9520,1385190,1310210,1138820,1108820,1078820,1048820,1018820,988820,958820,928820,898820]
[9520,9540,1392020,1317000,1143190,1113190,1083190,1053190,1023190,993190,963190,933190,903190]
[9540,9560,1398840,1323790,1147560,1117560,1087560,1057560,1027560,997560,967560,937560,907560]
[9560,9580,1405670,1330580,1151920,1121920,1091920,1061920,1031920,1001920,971920,941920,911920]
[9580,9600,1412490,1337370,1156290,1126290,1096290,1066290,1036290,1006290,976290,946290,916290]
[9600,9620,1419320,1344160,1160660,1130660,1100660,1070660,1040660,1010660,980660,950660,920660]
[9620,9640,1426140,1350950,1165030,1135030,1105030,1075030,1045030,1015030,985030,955030,925030]
[9640,9660,1432970,1357740,1169400,1139400,1109400,1079400,1049400,1019400,989400,959400,929400]
[9660,9680,1439790,1364530,1173760,1143760,1113760,1083760,1053760,1023760,993760,963760,933760]
[9680,9700,1446620,1371320,1178130,1148130,1118130,1088130,1058130,1028130,998130,968130,938130]
[9700,9720,1453440,1378110,1182500,1152500,1122500,1092500,1062500,1032500,1002500,972500,942500]
[9720,9740,1460270,1384900,1186870,1156870,1126870,1096870,1066870,1036870,1006870,976870,946870]
[9740,9760,1467090,1391690,1191240,1161240,1131240,1101240,1071240,1041240,1011240,981240,951240]
[9760,9780,1473920,1398480,1195600,1165600,1135600,1105600,1075600,1045600,1015600,985600,955600]
[9780,9800,1480740,1405270,1199970,1169970,1139970,1109970,1079970,1049970,1019970,989970,959970]
[9800,9820,1487570,1412060,1204340,1174340,1144340,1114340,1084340,1054340,1024340,994340,964340]
[9820,9840,1494390,1418850,1208710,1178710,1148710,1118710,1088710,1058710,1028710,998710,968710]
[9840,9860,1501220,1425640,1213080,1183080,1153080,1123080,1093080,1063080,1033080,1003080,973080]
[9860,9880,1508040,1432430,1217440,1187440,1157440,1127440,1097440,1067440,1037440,1007440,977440]
[9880,9900,1514870,1439220,1221810,1191810,1161810,1131810,1101810,1071810,1041810,1011810,981810]
[9900,9920,1521690,1446010,1226180,1196180,1166180,1136180,1106180,1076180,1046180,1016180,986180]
[9920,9940,1528520,1452800,1230550,1200550,1170550,1140550,1110550,1080550,1050550,1020550,990550]
[9940,9960,1535340,1459590,1234920,1204920,1174920,1144920,1114920,1084920,1054920,1024920,994920]
[9960,9980,1542170,1466380,1239280,1209280,1179280,1149280,1119280,1089280,1059280,1029280,999280]
[9980,10000,1548990,1473170,1243650,1213650,1183650,1153650,1123650,1093650,1063650,1033650,1003650]
["10,000천원",null,1552400,1476570,1245840,1215840,1185840,1155840,1125840,1095840,1065840,1035840,1005840]
["10,000천원 초과",null,"(10,000천원인 경우의 해당 세액) + (10,000천원을 초과하는 금액에 98퍼센트를 곱한 금액의 35퍼센트 상당액)"]
["14,000천원 이하"]
["14,000천원 초과",null,"(10,000천원인 경우의 해당세액) + (1,372,000원) + (14,000천원을 초과하는 금액에 98퍼센트를 곱한 금액의 38퍼센트 상당액) "]
["28,000천원 이하"]
["28,000천원 초과",null,"(10,000천원인 경우의 해당세액) + (6,585,600원) + (28,000천원을 초과하는 금액에 98퍼센트를 곱한 금액의 40퍼센트 상당액) "]
["30,000천원 이하"]
["30,000천원 초과",null,"(10,000천원인 경우의 해당세액) + (7,369,600원) + (30,000천원을 초과하는 금액의 40퍼센트 상당액) "]
["45,000천원 이하"]
["45,000천원 초과",null,"(10,000천원인 경우의 해당세액) + (13,369,600원) + (45,000천원을 초과하는 금액의 42퍼센트 상당액) "]
["87,000천원 이하"]
["87,000천원 초과",null,"(10,000천원인 경우의 해당세액) + (31,009,600원) + (87,000천원을 초과하는 금액의 45퍼센트 상당액) "]
[null,null,"`"]

{"sheet":"option","index":5,"n_rows":306,"n_cols":32,"rows_kept":306,"cut":false,"hidden":true,"merged":[]}
["과세","항목",1,2,3,4,5,6,7,8,9,10,11,12,13,14,15]
["비과세","과세",0,1,0,0,0,0,0,0,0,0,0,0,0,0,0]
[null,"절사단위",0,0,0,0,0,0]
["직접입력"]
["소득세",null,null,null,null,null,null,null,null,null,null,null,null,null,null,null,null,null,"5. 지급액 상위 5인"]
["지방소득세",null,"1. 사원별 급여 통계비교",null,null,"0.사원 급여 통계",null,null,null,null,null,null,null,null,null,null,null,null,null,"사원명","지급합계","랭크","랭크보정","기본급","기본급 외 수당","랭크","랭크보정",null,"지급액 상위 5인찾기","지급액합계","기본급","기본급 외 지급액"]
["국민연금",null,3,15,null,1,"직급",null,null,null,null,null,null,null,null,null,null,null,1,{"$f":"'급여대장(입력)'!C6","v":"홍길동"},{"$f":"_xlfn.IFNA(VLOOKUP(T7,'급여대장(입력)'!$C$6:$V$22,20,0),0)","v":3000000},{"$f":"RANK(U7,$U$7:$U$306)","v":{"$error":"#REF!"}},{"$f":"$V7+COUNTIFS($V$7:$V$306,$V7,$S$7:$S$306,\"<\"&S7)","v":{"$error":"#REF!"}},{"$f":"IFERROR(VLOOKUP(T7,표1[[사원명]:[열3]],11,0),0)","v":0},{"$f":"U7-X7","v":3000000},{"$f":"RANK(Y7,$Y$7:$Y$306)","v":{"$error":"#REF!"}},{"$f":"$Z7+COUNTIFS($Z$7:$Z$306,$Z7,$S$7:$S$306,\"<\"&S7)","v":{"$error":"#REF!"}},null,{"$f":"INDEX($S$7:$W$60,MATCH(1,$W$7:$W$60,0),2)","v":{"$error":"#N/A"}},{"$f":"VLOOKUP(AC7,$T:$U,2,0)","v":{"$error":"#N/A"}},{"$f":"IFERROR(VLOOKUP(AC7,'급여대장(입력)'!$C$6:$G$282,5,0),0)","v":0},{"$f":"AD7-AE7","v":{"$error":"#N/A"}}]
["건강보험",null,{"$f":"OFFSET(표1[[#Headers],[사원명]],option!$C$7,0)","v":"김"},{"$f":"OFFSET(표1[[#Headers],[사원명]],option!$D$7,0)","v":0},null,{"$f":"OFFSET(표1[[#Headers],[사원명]],option!$F$7,0)","v":"홍길동"},{"$f":"_xlfn.IFNA(VLOOKUP(F8,표1[[사원명]:[직책]],4,0),\"\")","v":"OP"},null,null,null,null,null,null,null,null,null,null,null,2,{"$f":"'급여대장(입력)'!C7","v":"아무개"},{"$f":"_xlfn.IFNA(VLOOKUP(T8,'급여대장(입력)'!$C$6:$V$22,20,0),0)","v":2900000},{"$f":"RANK(U8,$U$7:$U$306)","v":{"$error":"#REF!"}},{"$f":"$V8+COUNTIFS($V$7:$V$306,$V8,$S$7:$S$306,\"<\"&S8)","v":{"$error":"#REF!"}},{"$f":"IFERROR(VLOOKUP(T8,표1[[사원명]:[열3]],11,0),0)","v":0},{"$f":"U8-X8","v":2900000},{"$f":"RANK(Y8,$Y$7:$Y$306)","v":{"$error":"#REF!"}},{"$f":"$Z8+COUNTIFS($Z$7:$Z$306,$Z8,$S$7:$S$306,\"<\"&S8)","v":{"$error":"#REF!"}},null,{"$f":"INDEX($S$7:$W$60,MATCH(2,$W$7:$W$60,0),2)","v":{"$error":"#N/A"}},{"$f":"VLOOKUP(AC8,$T:$U,2,0)","v":{"$error":"#N/A"}},{"$f":"IFERROR(VLOOKUP(AC8,'급여대장(입력)'!$C$6:$G$282,5,0),0)","v":0},{"$f":"AD8-AE8","v":{"$error":"#N/A"}}]
["노인장기요양",null,null,null,null,null,null,null,null,null,null,null,null,null,null,null,null,null,3,{"$f":"'급여대장(입력)'!C8","v":"김"},{"$f":"_xlfn.IFNA(VLOOKUP(T9,'급여대장(입력)'!$C$6:$V$22,20,0),0)","v":4000000},{"$error":"#REF!"},{"$error":"#REF!"},{"$f":"IFERROR(VLOOKUP(T9,표1[[사원명]:[열3]],11,0),0)","v":0},4000000,{"$error":"#REF!"},{"$error":"#REF!"},null,{"$f":"INDEX($S$7:$W$60,MATCH(3,$W$7:$W$60,0),2)","v":{"$error":"#N/A"}},{"$error":"#N/A"},{"$f":"IFERROR(VLOOKUP(AC9,'급여대장(입력)'!$C$6:$G$282,5,0),0)","v":0},{"$error":"#N/A"}]
["고용보험",null,null,null,null,null,null,null,null,null,null,null,null,null,null,null,null,null,4,{"$f":"'급여대장(입력)'!C9","v":"이"},{"$f":"_xlfn.IFNA(VLOOKUP(T10,'급여대장(입력)'!$C$6:$V$22,20,0),0)","v":3900000},{"$error":"#REF!"},{"$error":"#REF!"},{"$f":"IFERROR(VLOOKUP(T10,표1[[사원명]:[열3]],11,0),0)","v":0},3900000,{"$error":"#REF!"},{"$error":"#REF!"},null,{"$f":"INDEX($S$7:$W$60,MATCH(4,$W$7:$W$60,0),2)","v":{"$error":"#N/A"}},{"$error":"#N/A"},{"$f":"IFERROR(VLOOKUP(AC10,'급여대장(입력)'!$C$6:$G$282,5,0),0)","v":0},{"$error":"#N/A"}]
[null,null,null,null,null,null,null,null,null,null,null,null,null,null,null,null,null,null,5,{"$f":"'급여대장(입력)'!C10","v":"박"},{"$f":"_xlfn.IFNA(VLOOKUP(T11,'급여대장(입력)'!$C$6:$V$22,20,0),0)","v":3800000},{"$error":"#REF!"},{"$error":"#REF!"},{"$f":"IFERROR(VLOOKUP(T11,표1[[사원명]:[열3]],11,0),0)","v":0},3800000,{"$error":"#REF!"},{"$error":"#REF!"},null,{"$f":"INDEX($S$7:$W$60,MATCH(5,$W$7:$W$60,0),2)","v":{"$error":"#N/A"}},{"$error":"#N/A"},{"$f":"IFERROR(VLOOKUP(AC11,'급여대장(입력)'!$C$6:$G$282,5,0),0)","v":0},{"$error":"#N/A"}]
["없음",null,null,null,null,null,null,null,null,null,null,null,null,null,null,null,null,null,6,{"$f":"'급여대장(입력)'!C22","v":0},{"$f":"_xlfn.IFNA(VLOOKUP(T12,'급여대장(입력)'!$C$6:$V$22,20,0),0)","v":0},{"$error":"#REF!"},{"$error":"#REF!"},{"$f":"IFERROR(VLOOKUP(T12,표1[[사원명]:[열3]],11,0),0)","v":0},0,{"$error":"#REF!"},{"$error":"#REF!"}]
["원단위",null,null,null,null,null,null,null,null,null,null,null,null,null,null,null,null,null,7,{"$f":"'급여대장(입력)'!#REF!","v":{"$error":"#REF!"}},{"$f":"_xlfn.IFNA(VLOOKUP(T13,'급여대장(입력)'!$C$6:$V$22,20,0),0)","v":{"$error":"#REF!"}},{"$error":"#REF!"},{"$error":"#REF!"},{"$f":"IFERROR(VLOOKUP(T13,표1[[사원명]:[열3]],11,0),0)","v":0},{"$error":"#REF!"},{"$error":"#REF!"},{"$error":"#REF!"},null,"기본급 외 지급액 상위 5인","지급액합계"]
["십단위",null,null,null,null,null,null,null,null,null,null,null,null,null,null,null,null,null,8,{"$f":"'급여대장(입력)'!#REF!","v":{"$error":"#REF!"}},{"$f":"_xlfn.IFNA(VLOOKUP(T14,'급여대장(입력)'!$C$6:$V$22,20,0),0)","v":{"$error":"#REF!"}},{"$error":"#REF!"},{"$error":"#REF!"},{"$f":"IFERROR(VLOOKUP(T14,표1[[사원명]:[열3]],11,0),0)","v":0},{"$error":"#REF!"},{"$error":"#REF!"},{"$error":"#REF!"},null,{"$f":"INDEX($S$7:$AA$306,MATCH(1,$AA$7:$AA$60,0),2)","v":{"$error":"#N/A"}},{"$f":"VLOOKUP(AC14,T:Y,6,0)","v":{"$error":"#N/A"}}]
["백단위",null,null,null,null,null,null,null,null,null,null,null,null,null,null,null,null,null,9,{"$f":"'급여대장(입력)'!#REF!","v":{"$error":"#REF!"}},{"$f":"_xlfn.IFNA(VLOOKUP(T15,'급여대장(입력)'!$C$6:$V$22,20,0),0)","v":{"$error":"#REF!"}},{"$error":"#REF!"},{"$error":"#REF!"},{"$f":"IFERROR(VLOOKUP(T15,표1[[사원명]:[열3]],11,0),0)","v":0},{"$error":"#REF!"},{"$error":"#REF!"},{"$error":"#REF!"},null,{"$f":"INDEX($S$7:$AA$306,MATCH(2,$AA$7:$AA$60,0),2)","v":{"$error":"#N/A"}},{"$f":"VLOOKUP(AC15,T:Y,6,0)","v":{"$error":"#N/A"}}]
["천단위",null,null,null,null,null,null,null,null,null,null,null,null,null,null,null,null,null,10,{"$f":"'급여대장(입력)'!#REF!","v":{"$error":"#REF!"}},{"$f":"_xlfn.IFNA(VLOOKUP(T16,'급여대장(입력)'!$C$6:$V$22,20,0),0)","v":{"$error":"#REF!"}},{"$error":"#REF!"},{"$error":"#REF!"},{"$f":"IFERROR(VLOOKUP(T16,표1[[사원명]:[열3]],11,0),0)","v":0},{"$error":"#REF!"},{"$error":"#REF!"},{"$error":"#REF!"},null,{"$f":"INDEX($S$7:$AA$306,MATCH(3,$AA$7:$AA$60,0),2)","v":{"$error":"#N/A"}},{"$error":"#N/A"}]
[null,null,null,null,null,null,null,null,null,null,null,null,null,null,null,null,null,null,11,{"$f":"'급여대장(입력)'!#REF!","v":{"$error":"#REF!"}},{"$f":"_xlfn.IFNA(VLOOKUP(T17,'급여대장(입력)'!$C$6:$V$22,20,0),0)","v":{"$error":"#REF!"}},{"$error":"#REF!"},{"$error":"#REF!"},{"$f":"IFERROR(VLOOKUP(T17,표1[[사원명]:[열3]],11,0),0)","v":0},{"$error":"#REF!"},{"$error":"#REF!"},{"$error":"#REF!"},null,{"$f":"INDEX($S$7:$AA$306,MATCH(4,$AA$7:$AA$60,0),2)","v":{"$error":"#N/A"}},{"$error":"#N/A"}]
[20,null,null,null,null,null,null,null,null,null,null,null,null,null,null,null,null,null,12,{"$f":"'급여대장(입력)'!#REF!","v":{"$error":"#REF!"}},{"$f":"_xlfn.IFNA(VLOOKUP(T18,'급여대장(입력)'!$C$6:$V$22,20,0),0)","v":{"$error":"#REF!"}},{"$error":"#REF!"},{"$error":"#REF!"},{"$f":"IFERROR(VLOOKUP(T18,표1[[사원명]:[열3]],11,0),0)","v":0},{"$error":"#REF!"},{"$error":"#REF!"},{"$error":"#REF!"},null,{"$f":"INDEX($S$7:$AA$306,MATCH(5,$AA$7:$AA$60,0),2)","v":{"$error":"#N/A"}},{"$error":"#N/A"}]
[null,null,null,null,null,null,null,null,null,null,null,null,null,null,null,null,null,null,13,{"$f":"'급여대장(입력)'!#REF!","v":{"$error":"#REF!"}},{"$f":"_xlfn.IFNA(VLOOKUP(T19,'급여대장(입력)'!$C$6:$V$22,20,0),0)","v":{"$error":"#REF!"}},{"$error":"#REF!"},{"$error":"#REF!"},{"$f":"IFERROR(VLOOKUP(T19,표1[[사원명]:[열3]],11,0),0)","v":0},{"$error":"#REF!"},{"$error":"#REF!"},{"$error":"#REF!"}]
[null,null,null,null,null,null,null,null,null,null,null,null,null,null,null,null,null,null,14,{"$f":"'급여대장(입력)'!#REF!","v":{"$error":"#REF!"}},{"$f":"_xlfn.IFNA(VLOOKUP(T20,'급여대장(입력)'!$C$6:$V$22,20,0),0)","v":{"$error":"#REF!"}},{"$error":"#REF!"},{"$error":"#REF!"},{"$f":"IFERROR(VLOOKUP(T20,표1[[사원명]:[열3]],11,0),0)","v":0},{"$error":"#REF!"},{"$error":"#REF!"},{"$error":"#REF!"}]
[null,null,null,null,null,null,null,null,null,null,null,null,null,null,null,null,null,null,15,{"$f":"'급여대장(입력)'!#REF!","v":{"$error":"#REF!"}},{"$f":"_xlfn.IFNA(VLOOKUP(T21,'급여대장(입력)'!$C$6:$V$22,20,0),0)","v":{"$error":"#REF!"}},{"$error":"#REF!"},{"$error":"#REF!"},{"$f":"IFERROR(VLOOKUP(T21,표1[[사원명]:[열3]],11,0),0)","v":0},{"$error":"#REF!"},{"$error":"#REF!"},{"$error":"#REF!"}]
[null,null,null,null,null,null,null,null,null,null,null,null,null,null,null,null,null,null,16,{"$f":"'급여대장(입력)'!#REF!","v":{"$error":"#REF!"}},{"$f":"_xlfn.IFNA(VLOOKUP(T22,'급여대장(입력)'!$C$6:$V$22,20,0),0)","v":{"$error":"#REF!"}},{"$error":"#REF!"},{"$error":"#REF!"},{"$f":"IFERROR(VLOOKUP(T22,표1[[사원명]:[열3]],11,0),0)","v":0},{"$error":"#REF!"},{"$error":"#REF!"},{"$error":"#REF!"}]
[null,null,null,null,null,null,null,null,null,null,null,null,null,null,null,null,null,null,17,{"$f":"'급여대장(입력)'!#REF!","v":{"$error":"#REF!"}},{"$f":"_xlfn.IFNA(VLOOKUP(T23,'급여대장(입력)'!$C$6:$V$22,20,0),0)","v":{"$error":"#REF!"}},{"$error":"#REF!"},{"$error":"#REF!"},{"$f":"IFERROR(VLOOKUP(T23,표1[[사원명]:[열3]],11,0),0)","v":0},{"$error":"#REF!"},{"$error":"#REF!"},{"$error":"#REF!"}]
[null,null,null,null,null,null,null,null,null,null,null,null,null,null,null,null,null,null,18,{"$f":"'급여대장(입력)'!#REF!","v":{"$error":"#REF!"}},{"$f":"_xlfn.IFNA(VLOOKUP(T24,'급여대장(입력)'!$C$6:$V$22,20,0),0)","v":{"$error":"#REF!"}},{"$error":"#REF!"},{"$error":"#REF!"},{"$f":"IFERROR(VLOOKUP(T24,표1[[사원명]:[열3]],11,0),0)","v":0},{"$error":"#REF!"},{"$error":"#REF!"},{"$error":"#REF!"}]
[null,null,null,null,null,null,null,null,null,null,null,null,null,null,null,null,null,null,19,{"$f":"'급여대장(입력)'!#REF!","v":{"$error":"#REF!"}},{"$f":"_xlfn.IFNA(VLOOKUP(T25,'급여대장(입력)'!$C$6:$V$22,20,0),0)","v":{"$error":"#REF!"}},{"$error":"#REF!"},{"$error":"#REF!"},{"$f":"IFERROR(VLOOKUP(T25,표1[[사원명]:[열3]],11,0),0)","v":0},{"$error":"#REF!"},{"$error":"#REF!"},{"$error":"#REF!"}]
[null,null,null,null,null,null,null,null,null,null,null,null,null,null,null,null,null,null,20,{"$f":"'급여대장(입력)'!#REF!","v":{"$error":"#REF!"}},{"$f":"_xlfn.IFNA(VLOOKUP(T26,'급여대장(입력)'!$C$6:$V$22,20,0),0)","v":{"$error":"#REF!"}},{"$error":"#REF!"},{"$error":"#REF!"},{"$f":"IFERROR(VLOOKUP(T26,표1[[사원명]:[열3]],11,0),0)","v":0},{"$error":"#REF!"},{"$error":"#REF!"},{"$error":"#REF!"}]
[null,null,null,null,null,null,null,null,null,null,null,null,null,null,null,null,null,null,21,{"$f":"'급여대장(입력)'!#REF!","v":{"$error":"#REF!"}},{"$f":"_xlfn.IFNA(VLOOKUP(T27,'급여대장(입력)'!$C$6:$V$22,20,0),0)","v":{"$error":"#REF!"}},{"$error":"#REF!"},{"$error":"#REF!"},{"$f":"IFERROR(VLOOKUP(T27,표1[[사원명]:[열3]],11,0),0)","v":0},{"$error":"#REF!"},{"$error":"#REF!"},{"$error":"#REF!"}]
[null,null,null,null,null,null,null,null,null,null,null,null,null,null,null,null,null,null,22,{"$f":"'급여대장(입력)'!#REF!","v":{"$error":"#REF!"}},{"$f":"_xlfn.IFNA(VLOOKUP(T28,'급여대장(입력)'!$C$6:$V$22,20,0),0)","v":{"$error":"#REF!"}},{"$error":"#REF!"},{"$error":"#REF!"},{"$f":"IFERROR(VLOOKUP(T28,표1[[사원명]:[열3]],11,0),0)","v":0},{"$error":"#REF!"},{"$error":"#REF!"},{"$error":"#REF!"}]
[null,null,null,null,null,null,null,null,null,null,null,null,null,null,null,null,null,null,23,{"$f":"'급여대장(입력)'!#REF!","v":{"$error":"#REF!"}},{"$f":"_xlfn.IFNA(VLOOKUP(T29,'급여대장(입력)'!$C$6:$V$22,20,0),0)","v":{"$error":"#REF!"}},{"$error":"#REF!"},{"$error":"#REF!"},{"$f":"IFERROR(VLOOKUP(T29,표1[[사원명]:[열3]],11,0),0)","v":0},{"$error":"#REF!"},{"$error":"#REF!"},{"$error":"#REF!"}]
[null,null,null,null,null,null,null,null,null,null,null,null,null,null,null,null,null,null,24,{"$f":"'급여대장(입력)'!#REF!","v":{"$error":"#REF!"}},{"$f":"_xlfn.IFNA(VLOOKUP(T30,'급여대장(입력)'!$C$6:$V$22,20,0),0)","v":{"$error":"#REF!"}},{"$error":"#REF!"},{"$error":"#REF!"},{"$f":"IFERROR(VLOOKUP(T30,표1[[사원명]:[열3]],11,0),0)","v":0},{"$error":"#REF!"},{"$error":"#REF!"},{"$error":"#REF!"}]
[null,null,null,null,null,null,null,null,null,null,null,null,null,null,null,null,null,null,25,{"$f":"'급여대장(입력)'!#REF!","v":{"$error":"#REF!"}},{"$f":"_xlfn.IFNA(VLOOKUP(T31,'급여대장(입력)'!$C$6:$V$22,20,0),0)","v":{"$error":"#REF!"}},{"$error":"#REF!"},{"$error":"#REF!"},{"$f":"IFERROR(VLOOKUP(T31,표1[[사원명]:[열3]],11,0),0)","v":0},{"$error":"#REF!"},{"$error":"#REF!"},{"$error":"#REF!"}]
[null,null,null,null,null,null,null,null,null,null,null,null,null,null,null,null,null,null,26,{"$f":"'급여대장(입력)'!#REF!","v":{"$error":"#REF!"}},{"$f":"_xlfn.IFNA(VLOOKUP(T32,'급여대장(입력)'!$C$6:$V$22,20,0),0)","v":{"$error":"#REF!"}},{"$error":"#REF!"},{"$error":"#REF!"},{"$f":"IFERROR(VLOOKUP(T32,표1[[사원명]:[열3]],11,0),0)","v":0},{"$error":"#REF!"},{"$error":"#REF!"},{"$error":"#REF!"}]
[null,null,null,null,null,null,null,null,null,null,null,null,null,null,null,null,null,null,27,{"$f":"'급여대장(입력)'!#REF!","v":{"$error":"#REF!"}},{"$f":"_xlfn.IFNA(VLOOKUP(T33,'급여대장(입력)'!$C$6:$V$22,20,0),0)","v":{"$error":"#REF!"}},{"$error":"#REF!"},{"$error":"#REF!"},{"$f":"IFERROR(VLOOKUP(T33,표1[[사원명]:[열3]],11,0),0)","v":0},{"$error":"#REF!"},{"$error":"#REF!"},{"$error":"#REF!"}]
[null,null,null,null,null,null,null,null,null,null,null,null,null,null,null,null,null,null,28,{"$f":"'급여대장(입력)'!#REF!","v":{"$error":"#REF!"}},{"$f":"_xlfn.IFNA(VLOOKUP(T34,'급여대장(입력)'!$C$6:$V$22,20,0),0)","v":{"$error":"#REF!"}},{"$error":"#REF!"},{"$error":"#REF!"},{"$f":"IFERROR(VLOOKUP(T34,표1[[사원명]:[열3]],11,0),0)","v":0},{"$error":"#REF!"},{"$error":"#REF!"},{"$error":"#REF!"}]
[null,null,null,null,null,null,null,null,null,null,null,null,null,null,null,null,null,null,29,{"$f":"'급여대장(입력)'!#REF!","v":{"$error":"#REF!"}},{"$f":"_xlfn.IFNA(VLOOKUP(T35,'급여대장(입력)'!$C$6:$V$22,20,0),0)","v":{"$error":"#REF!"}},{"$error":"#REF!"},{"$error":"#REF!"},{"$f":"IFERROR(VLOOKUP(T35,표1[[사원명]:[열3]],11,0),0)","v":0},{"$error":"#REF!"},{"$error":"#REF!"},{"$error":"#REF!"}]
[null,null,null,null,null,null,null,null,null,null,null,null,null,null,null,null,null,null,30,{"$f":"'급여대장(입력)'!#REF!","v":{"$error":"#REF!"}},{"$f":"_xlfn.IFNA(VLOOKUP(T36,'급여대장(입력)'!$C$6:$V$22,20,0),0)","v":{"$error":"#REF!"}},{"$error":"#REF!"},{"$error":"#REF!"},{"$f":"IFERROR(VLOOKUP(T36,표1[[사원명]:[열3]],11,0),0)","v":0},{"$error":"#REF!"},{"$error":"#REF!"},{"$error":"#REF!"}]
[null,null,null,null,null,null,null,null,null,null,null,null,null,null,null,null,null,null,31,{"$f":"'급여대장(입력)'!#REF!","v":{"$error":"#REF!"}},{"$f":"_xlfn.IFNA(VLOOKUP(T37,'급여대장(입력)'!$C$6:$V$22,20,0),0)","v":{"$error":"#REF!"}},{"$error":"#REF!"},{"$error":"#REF!"},{"$f":"IFERROR(VLOOKUP(T37,표1[[사원명]:[열3]],11,0),0)","v":0},{"$error":"#REF!"},{"$error":"#REF!"},{"$error":"#REF!"}]
[null,"0-2.사원 급여 통계",null,null,null,null,null,null,null,null,null,null,null,null,null,null,null,null,32,{"$f":"'급여대장(입력)'!#REF!","v":{"$error":"#REF!"}},{"$f":"_xlfn.IFNA(VLOOKUP(T38,'급여대장(입력)'!$C$6:$V$22,20,0),0)","v":{"$error":"#REF!"}},{"$error":"#REF!"},{"$error":"#REF!"},{"$f":"IFERROR(VLOOKUP(T38,표1[[사원명]:[열3]],11,0),0)","v":0},{"$error":"#REF!"},{"$error":"#REF!"},{"$error":"#REF!"}]
[null,"기본급","식대","차량유지비","연장수당","근속수당","소득세","지방소득세","국민연금","건강보험","노인장기요양","고용보험","상조회","지급합계","공제합계","차인지급액",null,null,33,{"$f":"'급여대장(입력)'!#REF!","v":{"$error":"#REF!"}},{"$f":"_xlfn.IFNA(VLOOKUP(T39,'급여대장(입력)'!$C$6:$V$22,20,0),0)","v":{"$error":"#REF!"}},{"$error":"#REF!"},{"$error":"#REF!"},{"$f":"IFERROR(VLOOKUP(T39,표1[[사원명]:[열3]],11,0),0)","v":0},{"$error":"#REF!"},{"$error":"#REF!"},{"$error":"#REF!"}]
["직급평균",{"$f":"IFERROR(AVERAGEIF('급여대장(입력)'!$F$6:$F$288,option!$G$8,'급여대장(입력)'!G6:G288),0)","v":2500000},{"$f":"IFERROR(AVERAGEIF('급여대장(입력)'!$F$6:$F$288,option!$G$8,'급여대장(입력)'!H6:H288),0)","v":100000},{"$f":"IFERROR(AVERAGEIF('급여대장(입력)'!$F$6:$F$288,option!$G$8,'급여대장(입력)'!I6:I288),0)","v":0},{"$f":"IFERROR(AVERAGEIF('급여대장(입력)'!$F$6:$F$288,option!$G$8,'급여대장(입력)'!J6:J288),0)","v":0},{"$f":"IFERROR(AVERAGEIF('급여대장(입력)'!$F$6:$F$288,option!$G$8,'급여대장(입력)'!K6:K288),0)","v":0},{"$f":"IFERROR(AVERAGEIF('급여대장(입력)'!$F$6:$F$288,option!$G$8,'급여대장(입력)'!W37:W288),0)","v":0},{"$f":"IFERROR(AVERAGEIF('급여대장(입력)'!$F$6:$F$288,option!$G$8,'급여대장(입력)'!X37:X290),0)","v":0},{"$f":"IFERROR(AVERAGEIF('급여대장(입력)'!$F$6:$F$288,option!$G$8,'급여대장(입력)'!Y37:Y290),0)","v":0},{"$f":"IFERROR(AVERAGEIF('급여대장(입력)'!$F$6:$F$288,option!$G$8,'급여대장(입력)'!Z37:Z290),0)","v":0},{"$f":"IFERROR(AVERAGEIF('급여대장(입력)'!$F$6:$F$288,option!$G$8,'급여대장(입력)'!AA37:AA290),0)","v":0},{"$f":"IFERROR(AVERAGEIF('급여대장(입력)'!$F$6:$F$288,option!$G$8,'급여대장(입력)'!AB37:AB290),0)","v":0},{"$f":"IFERROR(AVERAGEIF('급여대장(입력)'!$F$6:$F$288,option!$G$8,'급여대장(입력)'!AC37:AC290),0)","v":0},{"$f":"SUM(B40:F40)","v":2600000},{"$f":"SUM(G40:M40)","v":0},{"$f":"N40-O40","v":2600000},null,null,34,{"$f":"'급여대장(입력)'!#REF!","v":{"$error":"#REF!"}},{"$f":"_xlfn.IFNA(VLOOKUP(T40,'급여대장(입력)'!$C$6:$V$22,20,0),0)","v":{"$error":"#REF!"}},{"$error":"#REF!"},{"$error":"#REF!"},{"$f":"IFERROR(VLOOKUP(T40,표1[[사원명]:[열3]],11,0),0)","v":0},{"$error":"#REF!"},{"$error":"#REF!"},{"$error":"#REF!"}]
[null,null,null,null,null,null,null,null,null,null,null,null,null,null,null,null,null,null,35,{"$f":"'급여대장(입력)'!#REF!","v":{"$error":"#REF!"}},{"$f":"_xlfn.IFNA(VLOOKUP(T41,'급여대장(입력)'!$C$6:$V$22,20,0),0)","v":{"$error":"#REF!"}},{"$error":"#REF!"},{"$error":"#REF!"},{"$f":"IFERROR(VLOOKUP(T41,표1[[사원명]:[열3]],11,0),0)","v":0},{"$error":"#REF!"},{"$error":"#REF!"},{"$error":"#REF!"}]
[null,null,null,null,null,null,null,null,null,null,null,null,null,null,null,null,null,null,36,{"$f":"'급여대장(입력)'!#REF!","v":{"$error":"#REF!"}},{"$f":"_xlfn.IFNA(VLOOKUP(T42,'급여대장(입력)'!$C$6:$V$22,20,0),0)","v":{"$error":"#REF!"}},{"$error":"#REF!"},{"$error":"#REF!"},{"$f":"IFERROR(VLOOKUP(T42,표1[[사원명]:[열3]],11,0),0)","v":0},{"$error":"#REF!"},{"$error":"#REF!"},{"$error":"#REF!"}]
[null,null,null,null,null,null,null,null,null,null,null,null,null,null,null,null,null,null,37,{"$f":"'급여대장(입력)'!#REF!","v":{"$error":"#REF!"}},{"$f":"_xlfn.IFNA(VLOOKUP(T43,'급여대장(입력)'!$C$6:$V$22,20,0),0)","v":{"$error":"#REF!"}},{"$error":"#REF!"},{"$error":"#REF!"},{"$f":"IFERROR(VLOOKUP(T43,표1[[사원명]:[열3]],11,0),0)","v":0},{"$error":"#REF!"},{"$error":"#REF!"},{"$error":"#REF!"}]
[null,null,null,null,null,null,null,null,null,null,null,null,null,null,null,null,null,null,38,{"$f":"'급여대장(입력)'!#REF!","v":{"$error":"#REF!"}},{"$f":"_xlfn.IFNA(VLOOKUP(T44,'급여대장(입력)'!$C$6:$V$22,20,0),0)","v":{"$error":"#REF!"}},{"$error":"#REF!"},{"$error":"#REF!"},{"$f":"IFERROR(VLOOKUP(T44,표1[[사원명]:[열3]],11,0),0)","v":0},{"$error":"#REF!"},{"$error":"#REF!"},{"$error":"#REF!"}]
[null,null,null,null,null,null,null,null,null,null,null,null,null,null,null,null,null,null,39,{"$f":"'급여대장(입력)'!#REF!","v":{"$error":"#REF!"}},{"$f":"_xlfn.IFNA(VLOOKUP(T45,'급여대장(입력)'!$C$6:$V$22,20,0),0)","v":{"$error":"#REF!"}},{"$error":"#REF!"},{"$error":"#REF!"},{"$f":"IFERROR(VLOOKUP(T45,표1[[사원명]:[열3]],11,0),0)","v":0},{"$error":"#REF!"},{"$error":"#REF!"},{"$error":"#REF!"}]
[null,null,null,null,null,null,null,null,null,null,null,null,null,null,null,null,null,null,40,{"$f":"'급여대장(입력)'!#REF!","v":{"$error":"#REF!"}},{"$f":"_xlfn.IFNA(VLOOKUP(T46,'급여대장(입력)'!$C$6:$V$22,20,0),0)","v":{"$error":"#REF!"}},{"$error":"#REF!"},{"$error":"#REF!"},{"$f":"IFERROR(VLOOKUP(T46,표1[[사원명]:[열3]],11,0),0)","v":0},{"$error":"#REF!"},{"$error":"#REF!"},{"$error":"#REF!"}]
[null,null,null,null,null,null,null,null,null,null,null,null,null,null,null,null,null,null,41,{"$f":"'급여대장(입력)'!#REF!","v":{"$error":"#REF!"}},{"$f":"_xlfn.IFNA(VLOOKUP(T47,'급여대장(입력)'!$C$6:$V$22,20,0),0)","v":{"$error":"#REF!"}},{"$error":"#REF!"},{"$error":"#REF!"},{"$f":"IFERROR(VLOOKUP(T47,표1[[사원명]:[열3]],11,0),0)","v":0},{"$error":"#REF!"},{"$error":"#REF!"},{"$error":"#REF!"}]
[null,null,null,null,null,null,null,null,null,null,null,null,null,null,null,null,null,null,42,{"$f":"'급여대장(입력)'!#REF!","v":{"$error":"#REF!"}},{"$f":"_xlfn.IFNA(VLOOKUP(T48,'급여대장(입력)'!$C$6:$V$22,20,0),0)","v":{"$error":"#REF!"}},{"$error":"#REF!"},{"$error":"#REF!"},{"$f":"IFERROR(VLOOKUP(T48,표1[[사원명]:[열3]],11,0),0)","v":0},{"$error":"#REF!"},{"$error":"#REF!"},{"$error":"#REF!"}]
[null,null,null,null,null,null,null,null,null,null,null,null,null,null,null,null,null,null,43,{"$f":"'급여대장(입력)'!#REF!","v":{"$error":"#REF!"}},{"$f":"_xlfn.IFNA(VLOOKUP(T49,'급여대장(입력)'!$C$6:$V$22,20,0),0)","v":{"$error":"#REF!"}},{"$error":"#REF!"},{"$error":"#REF!"},{"$f":"IFERROR(VLOOKUP(T49,표1[[사원명]:[열3]],11,0),0)","v":0},{"$error":"#REF!"},{"$error":"#REF!"},{"$error":"#REF!"}]
[null,null,null,null,null,null,null,null,null,null,null,null,null,null,null,null,null,null,44,{"$f":"'급여대장(입력)'!#REF!","v":{"$error":"#REF!"}},{"$f":"_xlfn.IFNA(VLOOKUP(T50,'급여대장(입력)'!$C$6:$V$22,20,0),0)","v":{"$error":"#REF!"}},{"$error":"#REF!"},{"$error":"#REF!"},{"$f":"IFERROR(VLOOKUP(T50,표1[[사원명]:[열3]],11,0),0)","v":0},{"$error":"#REF!"},{"$error":"#REF!"},{"$error":"#REF!"}]
[null,null,null,null,null,null,null,null,null,null,null,null,null,null,null,null,null,null,45,{"$f":"'급여대장(입력)'!#REF!","v":{"$error":"#REF!"}},{"$f":"_xlfn.IFNA(VLOOKUP(T51,'급여대장(입력)'!$C$6:$V$22,20,0),0)","v":{"$error":"#REF!"}},{"$error":"#REF!"},{"$error":"#REF!"},{"$f":"IFERROR(VLOOKUP(T51,표1[[사원명]:[열3]],11,0),0)","v":0},{"$error":"#REF!"},{"$error":"#REF!"},{"$error":"#REF!"}]
[null,null,null,null,null,null,null,null,null,null,null,null,null,null,null,null,null,null,46,{"$f":"'급여대장(입력)'!C23","v":0},{"$f":"_xlfn.IFNA(VLOOKUP(T52,'급여대장(입력)'!$C$6:$V$22,20,0),0)","v":0},{"$error":"#REF!"},{"$error":"#REF!"},{"$f":"IFERROR(VLOOKUP(T52,표1[[사원명]:[열3]],11,0),0)","v":0},0,{"$error":"#REF!"},{"$error":"#REF!"}]
[null,null,null,null,null,null,null,null,null,null,null,null,null,null,null,null,null,null,47,{"$f":"'급여대장(입력)'!C36","v":0},{"$f":"_xlfn.IFNA(VLOOKUP(T53,'급여대장(입력)'!$C$6:$V$22,20,0),0)","v":0},{"$error":"#REF!"},{"$error":"#REF!"},{"$f":"IFERROR(VLOOKUP(T53,표1[[사원명]:[열3]],11,0),0)","v":0},0,{"$error":"#REF!"},{"$error":"#REF!"}]
[null,null,null,null,null,null,null,null,null,null,null,null,null,null,null,null,null,null,48,{"$f":"'급여대장(입력)'!C37","v":0},{"$f":"_xlfn.IFNA(VLOOKUP(T54,'급여대장(입력)'!$C$6:$V$22,20,0),0)","v":0},{"$error":"#REF!"},{"$error":"#REF!"},{"$f":"IFERROR(VLOOKUP(T54,표1[[사원명]:[열3]],11,0),0)","v":0},0,{"$error":"#REF!"},{"$error":"#REF!"}]
[null,null,null,null,null,null,null,null,null,null,null,null,null,null,null,null,null,null,49,{"$f":"'급여대장(입력)'!#REF!","v":{"$error":"#REF!"}},{"$f":"_xlfn.IFNA(VLOOKUP(T55,'급여대장(입력)'!$C$6:$V$22,20,0),0)","v":{"$error":"#REF!"}},{"$error":"#REF!"},{"$error":"#REF!"},{"$f":"IFERROR(VLOOKUP(T55,표1[[사원명]:[열3]],11,0),0)","v":0},{"$error":"#REF!"},{"$error":"#REF!"},{"$error":"#REF!"}]
[null,null,null,null,null,null,null,null,null,null,null,null,null,null,null,null,null,null,50,{"$f":"'급여대장(입력)'!#REF!","v":{"$error":"#REF!"}},{"$f":"_xlfn.IFNA(VLOOKUP(T56,'급여대장(입력)'!$C$6:$V$22,20,0),0)","v":{"$error":"#REF!"}},{"$error":"#REF!"},{"$error":"#REF!"},{"$f":"IFERROR(VLOOKUP(T56,표1[[사원명]:[열3]],11,0),0)","v":0},{"$error":"#REF!"},{"$error":"#REF!"},{"$error":"#REF!"}]
[null,null,null,null,null,null,null,null,null,null,null,null,null,null,null,null,null,null,51,{"$f":"'급여대장(입력)'!C38","v":0},{"$f":"_xlfn.IFNA(VLOOKUP(T57,'급여대장(입력)'!$C$6:$V$22,20,0),0)","v":0},{"$error":"#REF!"},{"$error":"#REF!"},{"$f":"IFERROR(VLOOKUP(T57,표1[[사원명]:[열3]],11,0),0)","v":0},0,{"$error":"#REF!"},{"$error":"#REF!"}]
[null,null,null,null,null,null,null,null,null,null,null,null,null,null,null,null,null,null,52,{"$f":"'급여대장(입력)'!C39","v":0},{"$f":"_xlfn.IFNA(VLOOKUP(T58,'급여대장(입력)'!$C$6:$V$22,20,0),0)","v":0},{"$error":"#REF!"},{"$error":"#REF!"},{"$f":"IFERROR(VLOOKUP(T58,표1[[사원명]:[열3]],11,0),0)","v":0},0,{"$error":"#REF!"},{"$error":"#REF!"}]
[null,null,null,null,null,null,null,null,null,null,null,null,null,null,null,null,null,null,53,{"$f":"'급여대장(입력)'!C40","v":0},{"$f":"_xlfn.IFNA(VLOOKUP(T59,'급여대장(입력)'!$C$6:$V$22,20,0),0)","v":0},{"$error":"#REF!"},{"$error":"#REF!"},{"$f":"IFERROR(VLOOKUP(T59,표1[[사원명]:[열3]],11,0),0)","v":0},0,{"$error":"#REF!"},{"$error":"#REF!"}]
[null,null,null,null,null,null,null,null,null,null,null,null,null,null,null,null,null,null,54,{"$f":"'급여대장(입력)'!C41","v":0},{"$f":"_xlfn.IFNA(VLOOKUP(T60,'급여대장(입력)'!$C$6:$V$22,20,0),0)","v":0},{"$error":"#REF!"},{"$error":"#REF!"},{"$f":"IFERROR(VLOOKUP(T60,표1[[사원명]:[열3]],11,0),0)","v":0},0,{"$error":"#REF!"},{"$error":"#REF!"}]
[null,null,null,null,null,null,null,null,null,null,null,null,null,null,null,null,null,null,55,{"$f":"'급여대장(입력)'!C42","v":0},{"$f":"_xlfn.IFNA(VLOOKUP(T61,'급여대장(입력)'!$C$6:$V$22,20,0),0)","v":0},{"$error":"#REF!"},{"$error":"#REF!"},{"$f":"IFERROR(VLOOKUP(T61,표1[[사원명]:[열3]],11,0),0)","v":0},0,{"$error":"#REF!"},{"$error":"#REF!"}]
[null,null,null,null,null,null,null,null,null,null,null,null,null,null,null,null,null,null,56,{"$f":"'급여대장(입력)'!C43","v":0},{"$f":"_xlfn.IFNA(VLOOKUP(T62,'급여대장(입력)'!$C$6:$V$22,20,0),0)","v":0},{"$error":"#REF!"},{"$error":"#REF!"},{"$f":"IFERROR(VLOOKUP(T62,표1[[사원명]:[열3]],11,0),0)","v":0},0,{"$error":"#REF!"},{"$error":"#REF!"}]
[null,null,null,null,null,null,null,null,null,null,null,null,null,null,null,null,null,null,57,{"$f":"'급여대장(입력)'!C44","v":0},{"$f":"_xlfn.IFNA(VLOOKUP(T63,'급여대장(입력)'!$C$6:$V$22,20,0),0)","v":0},{"$error":"#REF!"},{"$error":"#REF!"},{"$f":"IFERROR(VLOOKUP(T63,표1[[사원명]:[열3]],11,0),0)","v":0},0,{"$error":"#REF!"},{"$error":"#REF!"}]
[null,null,null,null,null,null,null,null,null,null,null,null,null,null,null,null,null,null,58,{"$f":"'급여대장(입력)'!C45","v":0},{"$f":"_xlfn.IFNA(VLOOKUP(T64,'급여대장(입력)'!$C$6:$V$22,20,0),0)","v":0},{"$error":"#REF!"},{"$error":"#REF!"},{"$f":"IFERROR(VLOOKUP(T64,표1[[사원명]:[열3]],11,0),0)","v":0},0,{"$error":"#REF!"},{"$error":"#REF!"}]
[null,null,null,null,null,null,null,null,null,null,null,null,null,null,null,null,null,null,59,{"$f":"'급여대장(입력)'!C46","v":0},{"$f":"_xlfn.IFNA(VLOOKUP(T65,'급여대장(입력)'!$C$6:$V$22,20,0),0)","v":0},{"$error":"#REF!"},{"$error":"#REF!"},{"$f":"IFERROR(VLOOKUP(T65,표1[[사원명]:[열3]],11,0),0)","v":0},0,{"$error":"#REF!"},{"$error":"#REF!"}]
[null,null,null,null,null,null,null,null,null,null,null,null,null,null,null,null,null,null,60,{"$f":"'급여대장(입력)'!C47","v":0},{"$f":"_xlfn.IFNA(VLOOKUP(T66,'급여대장(입력)'!$C$6:$V$22,20,0),0)","v":0},{"$error":"#REF!"},{"$error":"#REF!"},{"$f":"IFERROR(VLOOKUP(T66,표1[[사원명]:[열3]],11,0),0)","v":0},0,{"$error":"#REF!"},{"$error":"#REF!"}]
[null,null,null,null,null,null,null,null,null,null,null,null,null,null,null,null,null,null,61,{"$f":"'급여대장(입력)'!C48","v":0},{"$f":"_xlfn.IFNA(VLOOKUP(T67,'급여대장(입력)'!$C$6:$V$22,20,0),0)","v":0},{"$error":"#REF!"},{"$error":"#REF!"},{"$f":"IFERROR(VLOOKUP(T67,표1[[사원명]:[열3]],11,0),0)","v":0},0,{"$error":"#REF!"},{"$error":"#REF!"}]
[null,null,null,null,null,null,null,null,null,null,null,null,null,null,null,null,null,null,62,{"$f":"'급여대장(입력)'!C49","v":0},{"$f":"_xlfn.IFNA(VLOOKUP(T68,'급여대장(입력)'!$C$6:$V$22,20,0),0)","v":0},{"$error":"#REF!"},{"$error":"#REF!"},{"$f":"IFERROR(VLOOKUP(T68,표1[[사원명]:[열3]],11,0),0)","v":0},0,{"$error":"#REF!"},{"$error":"#REF!"}]
[null,null,null,null,null,null,null,null,null,null,null,null,null,null,null,null,null,null,63,{"$f":"'급여대장(입력)'!C50","v":0},{"$f":"_xlfn.IFNA(VLOOKUP(T69,'급여대장(입력)'!$C$6:$V$22,20,0),0)","v":0},{"$error":"#REF!"},{"$error":"#REF!"},{"$f":"IFERROR(VLOOKUP(T69,표1[[사원명]:[열3]],11,0),0)","v":0},0,{"$error":"#REF!"},{"$error":"#REF!"}]
[null,null,null,null,null,null,null,null,null,null,null,null,null,null,null,null,null,null,64,{"$f":"'급여대장(입력)'!C51","v":0},{"$f":"_xlfn.IFNA(VLOOKUP(T70,'급여대장(입력)'!$C$6:$V$22,20,0),0)","v":0},{"$error":"#REF!"},{"$error":"#REF!"},{"$f":"IFERROR(VLOOKUP(T70,표1[[사원명]:[열3]],11,0),0)","v":0},0,{"$error":"#REF!"},{"$error":"#REF!"}]
[null,null,null,null,null,null,null,null,null,null,null,null,null,null,null,null,null,null,65,{"$f":"'급여대장(입력)'!C52","v":0},{"$f":"_xlfn.IFNA(VLOOKUP(T71,'급여대장(입력)'!$C$6:$V$22,20,0),0)","v":0},{"$error":"#REF!"},{"$error":"#REF!"},{"$f":"IFERROR(VLOOKUP(T71,표1[[사원명]:[열3]],11,0),0)","v":0},0,{"$error":"#REF!"},{"$error":"#REF!"}]
[null,null,null,null,null,null,null,null,null,null,null,null,null,null,null,null,null,null,66,{"$f":"'급여대장(입력)'!C53","v":0},{"$f":"_xlfn.IFNA(VLOOKUP(T72,'급여대장(입력)'!$C$6:$V$22,20,0),0)","v":0},{"$f":"RANK(U72,$U$7:$U$306)","v":{"$error":"#REF!"}},{"$f":"$V72+COUNTIFS($V$7:$V$306,$V72,$S$7:$S$306,\"<\"&S72)","v":{"$error":"#REF!"}},{"$f":"IFERROR(VLOOKUP(T72,표1[[사원명]:[열3]],11,0),0)","v":0},{"$f":"U72-X72","v":0},{"$f":"RANK(Y72,$Y$7:$Y$306)","v":{"$error":"#REF!"}},{"$f":"$Z72+COUNTIFS($Z$7:$Z$306,$Z72,$S$7:$S$306,\"<\"&S72)","v":{"$error":"#REF!"}}]
[null,null,null,null,null,null,null,null,null,null,null,null,null,null,null,null,null,null,67,{"$f":"'급여대장(입력)'!C54","v":0},{"$f":"_xlfn.IFNA(VLOOKUP(T73,'급여대장(입력)'!$C$6:$V$22,20,0),0)","v":0},{"$error":"#REF!"},{"$error":"#REF!"},{"$f":"IFERROR(VLOOKUP(T73,표1[[사원명]:[열3]],11,0),0)","v":0},0,{"$error":"#REF!"},{"$error":"#REF!"}]
[null,null,null,null,null,null,null,null,null,null,null,null,null,null,null,null,null,null,68,{"$f":"'급여대장(입력)'!C55","v":0},{"$f":"_xlfn.IFNA(VLOOKUP(T74,'급여대장(입력)'!$C$6:$V$22,20,0),0)","v":0},{"$error":"#REF!"},{"$error":"#REF!"},{"$f":"IFERROR(VLOOKUP(T74,표1[[사원명]:[열3]],11,0),0)","v":0},0,{"$error":"#REF!"},{"$error":"#REF!"}]
[null,null,null,null,null,null,null,null,null,null,null,null,null,null,null,null,null,null,69,{"$f":"'급여대장(입력)'!C56","v":0},{"$f":"_xlfn.IFNA(VLOOKUP(T75,'급여대장(입력)'!$C$6:$V$22,20,0),0)","v":0},{"$error":"#REF!"},{"$error":"#REF!"},{"$f":"IFERROR(VLOOKUP(T75,표1[[사원명]:[열3]],11,0),0)","v":0},0,{"$error":"#REF!"},{"$error":"#REF!"}]
[null,null,null,null,null,null,null,null,null,null,null,null,null,null,null,null,null,null,70,{"$f":"'급여대장(입력)'!C57","v":0},{"$f":"_xlfn.IFNA(VLOOKUP(T76,'급여대장(입력)'!$C$6:$V$22,20,0),0)","v":0},{"$error":"#REF!"},{"$error":"#REF!"},{"$f":"IFERROR(VLOOKUP(T76,표1[[사원명]:[열3]],11,0),0)","v":0},0,{"$error":"#REF!"},{"$error":"#REF!"}]
[null,null,null,null,null,null,null,null,null,null,null,null,null,null,null,null,null,null,71,{"$f":"'급여대장(입력)'!C58","v":0},{"$f":"_xlfn.IFNA(VLOOKUP(T77,'급여대장(입력)'!$C$6:$V$22,20,0),0)","v":0},{"$error":"#REF!"},{"$error":"#REF!"},{"$f":"IFERROR(VLOOKUP(T77,표1[[사원명]:[열3]],11,0),0)","v":0},0,{"$error":"#REF!"},{"$error":"#REF!"}]
[null,null,null,null,null,null,null,null,null,null,null,null,null,null,null,null,null,null,72,{"$f":"'급여대장(입력)'!C59","v":0},{"$f":"_xlfn.IFNA(VLOOKUP(T78,'급여대장(입력)'!$C$6:$V$22,20,0),0)","v":0},{"$error":"#REF!"},{"$error":"#REF!"},{"$f":"IFERROR(VLOOKUP(T78,표1[[사원명]:[열3]],11,0),0)","v":0},0,{"$error":"#REF!"},{"$error":"#REF!"}]
[null,null,null,null,null,null,null,null,null,null,null,null,null,null,null,null,null,null,73,{"$f":"'급여대장(입력)'!C60","v":0},{"$f":"_xlfn.IFNA(VLOOKUP(T79,'급여대장(입력)'!$C$6:$V$22,20,0),0)","v":0},{"$error":"#REF!"},{"$error":"#REF!"},{"$f":"IFERROR(VLOOKUP(T79,표1[[사원명]:[열3]],11,0),0)","v":0},0,{"$error":"#REF!"},{"$error":"#REF!"}]
[null,null,null,null,null,null,null,null,null,null,null,null,null,null,null,null,null,null,74,{"$f":"'급여대장(입력)'!C61","v":0},{"$f":"_xlfn.IFNA(VLOOKUP(T80,'급여대장(입력)'!$C$6:$V$22,20,0),0)","v":0},{"$error":"#REF!"},{"$error":"#REF!"},{"$f":"IFERROR(VLOOKUP(T80,표1[[사원명]:[열3]],11,0),0)","v":0},0,{"$error":"#REF!"},{"$error":"#REF!"}]
[null,null,null,null,null,null,null,null,null,null,null,null,null,null,null,null,null,null,75,{"$f":"'급여대장(입력)'!C62","v":0},{"$f":"_xlfn.IFNA(VLOOKUP(T81,'급여대장(입력)'!$C$6:$V$22,20,0),0)","v":0},{"$error":"#REF!"},{"$error":"#REF!"},{"$f":"IFERROR(VLOOKUP(T81,표1[[사원명]:[열3]],11,0),0)","v":0},0,{"$error":"#REF!"},{"$error":"#REF!"}]
[null,null,null,null,null,null,null,null,null,null,null,null,null,null,null,null,null,null,76,{"$f":"'급여대장(입력)'!C63","v":0},{"$f":"_xlfn.IFNA(VLOOKUP(T82,'급여대장(입력)'!$C$6:$V$22,20,0),0)","v":0},{"$error":"#REF!"},{"$error":"#REF!"},{"$f":"IFERROR(VLOOKUP(T82,표1[[사원명]:[열3]],11,0),0)","v":0},0,{"$error":"#REF!"},{"$error":"#REF!"}]
[null,null,null,null,null,null,null,null,null,null,null,null,null,null,null,null,null,null,77,{"$f":"'급여대장(입력)'!C64","v":0},{"$f":"_xlfn.IFNA(VLOOKUP(T83,'급여대장(입력)'!$C$6:$V$22,20,0),0)","v":0},{"$error":"#REF!"},{"$error":"#REF!"},{"$f":"IFERROR(VLOOKUP(T83,표1[[사원명]:[열3]],11,0),0)","v":0},0,{"$error":"#REF!"},{"$error":"#REF!"}]
[null,null,null,null,null,null,null,null,null,null,null,null,null,null,null,null,null,null,78,{"$f":"'급여대장(입력)'!C65","v":0},{"$f":"_xlfn.IFNA(VLOOKUP(T84,'급여대장(입력)'!$C$6:$V$22,20,0),0)","v":0},{"$error":"#REF!"},{"$error":"#REF!"},{"$f":"IFERROR(VLOOKUP(T84,표1[[사원명]:[열3]],11,0),0)","v":0},0,{"$error":"#REF!"},{"$error":"#REF!"}]
[null,null,null,null,null,null,null,null,null,null,null,null,null,null,null,null,null,null,79,{"$f":"'급여대장(입력)'!C66","v":0},{"$f":"_xlfn.IFNA(VLOOKUP(T85,'급여대장(입력)'!$C$6:$V$22,20,0),0)","v":0},{"$error":"#REF!"},{"$error":"#REF!"},{"$f":"IFERROR(VLOOKUP(T85,표1[[사원명]:[열3]],11,0),0)","v":0},0,{"$error":"#REF!"},{"$error":"#REF!"}]
[null,null,null,null,null,null,null,null,null,null,null,null,null,null,null,null,null,null,80,{"$f":"'급여대장(입력)'!C67","v":0},{"$f":"_xlfn.IFNA(VLOOKUP(T86,'급여대장(입력)'!$C$6:$V$22,20,0),0)","v":0},{"$error":"#REF!"},{"$error":"#REF!"},{"$f":"IFERROR(VLOOKUP(T86,표1[[사원명]:[열3]],11,0),0)","v":0},0,{"$error":"#REF!"},{"$error":"#REF!"}]
[null,null,null,null,null,null,null,null,null,null,null,null,null,null,null,null,null,null,81,{"$f":"'급여대장(입력)'!C68","v":0},{"$f":"_xlfn.IFNA(VLOOKUP(T87,'급여대장(입력)'!$C$6:$V$22,20,0),0)","v":0},{"$error":"#REF!"},{"$error":"#REF!"},{"$f":"IFERROR(VLOOKUP(T87,표1[[사원명]:[열3]],11,0),0)","v":0},0,{"$error":"#REF!"},{"$error":"#REF!"}]
[null,null,null,null,null,null,null,null,null,null,null,null,null,null,null,null,null,null,82,{"$f":"'급여대장(입력)'!C69","v":0},{"$f":"_xlfn.IFNA(VLOOKUP(T88,'급여대장(입력)'!$C$6:$V$22,20,0),0)","v":0},{"$error":"#REF!"},{"$error":"#REF!"},{"$f":"IFERROR(VLOOKUP(T88,표1[[사원명]:[열3]],11,0),0)","v":0},0,{"$error":"#REF!"},{"$error":"#REF!"}]
[null,null,null,null,null,null,null,null,null,null,null,null,null,null,null,null,null,null,83,{"$f":"'급여대장(입력)'!C70","v":0},{"$f":"_xlfn.IFNA(VLOOKUP(T89,'급여대장(입력)'!$C$6:$V$22,20,0),0)","v":0},{"$error":"#REF!"},{"$error":"#REF!"},{"$f":"IFERROR(VLOOKUP(T89,표1[[사원명]:[열3]],11,0),0)","v":0},0,{"$error":"#REF!"},{"$error":"#REF!"}]
[null,null,null,null,null,null,null,null,null,null,null,null,null,null,null,null,null,null,84,{"$f":"'급여대장(입력)'!C71","v":0},{"$f":"_xlfn.IFNA(VLOOKUP(T90,'급여대장(입력)'!$C$6:$V$22,20,0),0)","v":0},{"$error":"#REF!"},{"$error":"#REF!"},{"$f":"IFERROR(VLOOKUP(T90,표1[[사원명]:[열3]],11,0),0)","v":0},0,{"$error":"#REF!"},{"$error":"#REF!"}]
[null,null,null,null,null,null,null,null,null,null,null,null,null,null,null,null,null,null,85,{"$f":"'급여대장(입력)'!C72","v":0},{"$f":"_xlfn.IFNA(VLOOKUP(T91,'급여대장(입력)'!$C$6:$V$22,20,0),0)","v":0},{"$error":"#REF!"},{"$error":"#REF!"},{"$f":"IFERROR(VLOOKUP(T91,표1[[사원명]:[열3]],11,0),0)","v":0},0,{"$error":"#REF!"},{"$error":"#REF!"}]
[null,null,null,null,null,null,null,null,null,null,null,null,null,null,null,null,null,null,86,{"$f":"'급여대장(입력)'!C73","v":0},{"$f":"_xlfn.IFNA(VLOOKUP(T92,'급여대장(입력)'!$C$6:$V$22,20,0),0)","v":0},{"$error":"#REF!"},{"$error":"#REF!"},{"$f":"IFERROR(VLOOKUP(T92,표1[[사원명]:[열3]],11,0),0)","v":0},0,{"$error":"#REF!"},{"$error":"#REF!"}]
[null,null,null,null,null,null,null,null,null,null,null,null,null,null,null,null,null,null,87,{"$f":"'급여대장(입력)'!C74","v":0},{"$f":"_xlfn.IFNA(VLOOKUP(T93,'급여대장(입력)'!$C$6:$V$22,20,0),0)","v":0},{"$error":"#REF!"},{"$error":"#REF!"},{"$f":"IFERROR(VLOOKUP(T93,표1[[사원명]:[열3]],11,0),0)","v":0},0,{"$error":"#REF!"},{"$error":"#REF!"}]
[null,null,null,null,null,null,null,null,null,null,null,null,null,null,null,null,null,null,88,{"$f":"'급여대장(입력)'!C75","v":0},{"$f":"_xlfn.IFNA(VLOOKUP(T94,'급여대장(입력)'!$C$6:$V$22,20,0),0)","v":0},{"$error":"#REF!"},{"$error":"#REF!"},{"$f":"IFERROR(VLOOKUP(T94,표1[[사원명]:[열3]],11,0),0)","v":0},0,{"$error":"#REF!"},{"$error":"#REF!"}]
[null,null,null,null,null,null,null,null,null,null,null,null,null,null,null,null,null,null,89,{"$f":"'급여대장(입력)'!C76","v":0},{"$f":"_xlfn.IFNA(VLOOKUP(T95,'급여대장(입력)'!$C$6:$V$22,20,0),0)","v":0},{"$error":"#REF!"},{"$error":"#REF!"},{"$f":"IFERROR(VLOOKUP(T95,표1[[사원명]:[열3]],11,0),0)","v":0},0,{"$error":"#REF!"},{"$error":"#REF!"}]
[null,null,null,null,null,null,null,null,null,null,null,null,null,null,null,null,null,null,90,{"$f":"'급여대장(입력)'!C77","v":0},{"$f":"_xlfn.IFNA(VLOOKUP(T96,'급여대장(입력)'!$C$6:$V$22,20,0),0)","v":0},{"$error":"#REF!"},{"$error":"#REF!"},{"$f":"IFERROR(VLOOKUP(T96,표1[[사원명]:[열3]],11,0),0)","v":0},0,{"$error":"#REF!"},{"$error":"#REF!"}]
[null,null,null,null,null,null,null,null,null,null,null,null,null,null,null,null,null,null,91,{"$f":"'급여대장(입력)'!C78","v":0},{"$f":"_xlfn.IFNA(VLOOKUP(T97,'급여대장(입력)'!$C$6:$V$22,20,0),0)","v":0},{"$error":"#REF!"},{"$error":"#REF!"},{"$f":"IFERROR(VLOOKUP(T97,표1[[사원명]:[열3]],11,0),0)","v":0},0,{"$error":"#REF!"},{"$error":"#REF!"}]
[null,null,null,null,null,null,null,null,null,null,null,null,null,null,null,null,null,null,92,{"$f":"'급여대장(입력)'!C79","v":0},{"$f":"_xlfn.IFNA(VLOOKUP(T98,'급여대장(입력)'!$C$6:$V$22,20,0),0)","v":0},{"$error":"#REF!"},{"$error":"#REF!"},{"$f":"IFERROR(VLOOKUP(T98,표1[[사원명]:[열3]],11,0),0)","v":0},0,{"$error":"#REF!"},{"$error":"#REF!"}]
[null,null,null,null,null,null,null,null,null,null,null,null,null,null,null,null,null,null,93,{"$f":"'급여대장(입력)'!C80","v":0},{"$f":"_xlfn.IFNA(VLOOKUP(T99,'급여대장(입력)'!$C$6:$V$22,20,0),0)","v":0},{"$error":"#REF!"},{"$error":"#REF!"},{"$f":"IFERROR(VLOOKUP(T99,표1[[사원명]:[열3]],11,0),0)","v":0},0,{"$error":"#REF!"},{"$error":"#REF!"}]
[null,null,null,null,null,null,null,null,null,null,null,null,null,null,null,null,null,null,94,{"$f":"'급여대장(입력)'!C81","v":0},{"$f":"_xlfn.IFNA(VLOOKUP(T100,'급여대장(입력)'!$C$6:$V$22,20,0),0)","v":0},{"$error":"#REF!"},{"$error":"#REF!"},{"$f":"IFERROR(VLOOKUP(T100,표1[[사원명]:[열3]],11,0),0)","v":0},0,{"$error":"#REF!"},{"$error":"#REF!"}]
[null,null,null,null,null,null,null,null,null,null,null,null,null,null,null,null,null,null,95,{"$f":"'급여대장(입력)'!C82","v":0},{"$f":"_xlfn.IFNA(VLOOKUP(T101,'급여대장(입력)'!$C$6:$V$22,20,0),0)","v":0},{"$error":"#REF!"},{"$error":"#REF!"},{"$f":"IFERROR(VLOOKUP(T101,표1[[사원명]:[열3]],11,0),0)","v":0},0,{"$error":"#REF!"},{"$error":"#REF!"}]
[null,null,null,null,null,null,null,null,null,null,null,null,null,null,null,null,null,null,96,{"$f":"'급여대장(입력)'!C83","v":0},{"$f":"_xlfn.IFNA(VLOOKUP(T102,'급여대장(입력)'!$C$6:$V$22,20,0),0)","v":0},{"$error":"#REF!"},{"$error":"#REF!"},{"$f":"IFERROR(VLOOKUP(T102,표1[[사원명]:[열3]],11,0),0)","v":0},0,{"$error":"#REF!"},{"$error":"#REF!"}]
[null,null,null,null,null,null,null,null,null,null,null,null,null,null,null,null,null,null,97,{"$f":"'급여대장(입력)'!C84","v":0},{"$f":"_xlfn.IFNA(VLOOKUP(T103,'급여대장(입력)'!$C$6:$V$22,20,0),0)","v":0},{"$error":"#REF!"},{"$error":"#REF!"},{"$f":"IFERROR(VLOOKUP(T103,표1[[사원명]:[열3]],11,0),0)","v":0},0,{"$error":"#REF!"},{"$error":"#REF!"}]
[null,null,null,null,null,null,null,null,null,null,null,null,null,null,null,null,null,null,98,{"$f":"'급여대장(입력)'!C85","v":0},{"$f":"_xlfn.IFNA(VLOOKUP(T104,'급여대장(입력)'!$C$6:$V$22,20,0),0)","v":0},{"$error":"#REF!"},{"$error":"#REF!"},{"$f":"IFERROR(VLOOKUP(T104,표1[[사원명]:[열3]],11,0),0)","v":0},0,{"$error":"#REF!"},{"$error":"#REF!"}]
[null,null,null,null,null,null,null,null,null,null,null,null,null,null,null,null,null,null,99,{"$f":"'급여대장(입력)'!C86","v":0},{"$f":"_xlfn.IFNA(VLOOKUP(T105,'급여대장(입력)'!$C$6:$V$22,20,0),0)","v":0},{"$error":"#REF!"},{"$error":"#REF!"},{"$f":"IFERROR(VLOOKUP(T105,표1[[사원명]:[열3]],11,0),0)","v":0},0,{"$error":"#REF!"},{"$error":"#REF!"}]
[null,null,null,null,null,null,null,null,null,null,null,null,null,null,null,null,null,null,100,{"$f":"'급여대장(입력)'!C87","v":0},{"$f":"_xlfn.IFNA(VLOOKUP(T106,'급여대장(입력)'!$C$6:$V$22,20,0),0)","v":0},{"$error":"#REF!"},{"$error":"#REF!"},{"$f":"IFERROR(VLOOKUP(T106,표1[[사원명]:[열3]],11,0),0)","v":0},0,{"$error":"#REF!"},{"$error":"#REF!"}]
[null,null,null,null,null,null,null,null,null,null,null,null,null,null,null,null,null,null,101,{"$f":"'급여대장(입력)'!C88","v":0},{"$f":"_xlfn.IFNA(VLOOKUP(T107,'급여대장(입력)'!$C$6:$V$22,20,0),0)","v":0},{"$error":"#REF!"},{"$error":"#REF!"},{"$f":"IFERROR(VLOOKUP(T107,표1[[사원명]:[열3]],11,0),0)","v":0},0,{"$error":"#REF!"},{"$error":"#REF!"}]
[null,null,null,null,null,null,null,null,null,null,null,null,null,null,null,null,null,null,102,{"$f":"'급여대장(입력)'!C89","v":0},{"$f":"_xlfn.IFNA(VLOOKUP(T108,'급여대장(입력)'!$C$6:$V$22,20,0),0)","v":0},{"$error":"#REF!"},{"$error":"#REF!"},{"$f":"IFERROR(VLOOKUP(T108,표1[[사원명]:[열3]],11,0),0)","v":0},0,{"$error":"#REF!"},{"$error":"#REF!"}]
[null,null,null,null,null,null,null,null,null,null,null,null,null,null,null,null,null,null,103,{"$f":"'급여대장(입력)'!C90","v":0},{"$f":"_xlfn.IFNA(VLOOKUP(T109,'급여대장(입력)'!$C$6:$V$22,20,0),0)","v":0},{"$error":"#REF!"},{"$error":"#REF!"},{"$f":"IFERROR(VLOOKUP(T109,표1[[사원명]:[열3]],11,0),0)","v":0},0,{"$error":"#REF!"},{"$error":"#REF!"}]
[null,null,null,null,null,null,null,null,null,null,null,null,null,null,null,null,null,null,104,{"$f":"'급여대장(입력)'!C91","v":0},{"$f":"_xlfn.IFNA(VLOOKUP(T110,'급여대장(입력)'!$C$6:$V$22,20,0),0)","v":0},{"$error":"#REF!"},{"$error":"#REF!"},{"$f":"IFERROR(VLOOKUP(T110,표1[[사원명]:[열3]],11,0),0)","v":0},0,{"$error":"#REF!"},{"$error":"#REF!"}]
[null,null,null,null,null,null,null,null,null,null,null,null,null,null,null,null,null,null,105,{"$f":"'급여대장(입력)'!C92","v":0},{"$f":"_xlfn.IFNA(VLOOKUP(T111,'급여대장(입력)'!$C$6:$V$22,20,0),0)","v":0},{"$error":"#REF!"},{"$error":"#REF!"},{"$f":"IFERROR(VLOOKUP(T111,표1[[사원명]:[열3]],11,0),0)","v":0},0,{"$error":"#REF!"},{"$error":"#REF!"}]
[null,null,null,null,null,null,null,null,null,null,null,null,null,null,null,null,null,null,106,{"$f":"'급여대장(입력)'!C93","v":0},{"$f":"_xlfn.IFNA(VLOOKUP(T112,'급여대장(입력)'!$C$6:$V$22,20,0),0)","v":0},{"$error":"#REF!"},{"$error":"#REF!"},{"$f":"IFERROR(VLOOKUP(T112,표1[[사원명]:[열3]],11,0),0)","v":0},0,{"$error":"#REF!"},{"$error":"#REF!"}]
[null,null,null,null,null,null,null,null,null,null,null,null,null,null,null,null,null,null,107,{"$f":"'급여대장(입력)'!C94","v":0},{"$f":"_xlfn.IFNA(VLOOKUP(T113,'급여대장(입력)'!$C$6:$V$22,20,0),0)","v":0},{"$error":"#REF!"},{"$error":"#REF!"},{"$f":"IFERROR(VLOOKUP(T113,표1[[사원명]:[열3]],11,0),0)","v":0},0,{"$error":"#REF!"},{"$error":"#REF!"}]
[null,null,null,null,null,null,null,null,null,null,null,null,null,null,null,null,null,null,108,{"$f":"'급여대장(입력)'!C95","v":0},{"$f":"_xlfn.IFNA(VLOOKUP(T114,'급여대장(입력)'!$C$6:$V$22,20,0),0)","v":0},{"$error":"#REF!"},{"$error":"#REF!"},{"$f":"IFERROR(VLOOKUP(T114,표1[[사원명]:[열3]],11,0),0)","v":0},0,{"$error":"#REF!"},{"$error":"#REF!"}]
[null,null,null,null,null,null,null,null,null,null,null,null,null,null,null,null,null,null,109,{"$f":"'급여대장(입력)'!C96","v":0},{"$f":"_xlfn.IFNA(VLOOKUP(T115,'급여대장(입력)'!$C$6:$V$22,20,0),0)","v":0},{"$error":"#REF!"},{"$error":"#REF!"},{"$f":"IFERROR(VLOOKUP(T115,표1[[사원명]:[열3]],11,0),0)","v":0},0,{"$error":"#REF!"},{"$error":"#REF!"}]
[null,null,null,null,null,null,null,null,null,null,null,null,null,null,null,null,null,null,110,{"$f":"'급여대장(입력)'!C97","v":0},{"$f":"_xlfn.IFNA(VLOOKUP(T116,'급여대장(입력)'!$C$6:$V$22,20,0),0)","v":0},{"$error":"#REF!"},{"$error":"#REF!"},{"$f":"IFERROR(VLOOKUP(T116,표1[[사원명]:[열3]],11,0),0)","v":0},0,{"$error":"#REF!"},{"$error":"#REF!"}]
[null,null,null,null,null,null,null,null,null,null,null,null,null,null,null,null,null,null,111,{"$f":"'급여대장(입력)'!C98","v":0},{"$f":"_xlfn.IFNA(VLOOKUP(T117,'급여대장(입력)'!$C$6:$V$22,20,0),0)","v":0},{"$error":"#REF!"},{"$error":"#REF!"},{"$f":"IFERROR(VLOOKUP(T117,표1[[사원명]:[열3]],11,0),0)","v":0},0,{"$error":"#REF!"},{"$error":"#REF!"}]
[null,null,null,null,null,null,null,null,null,null,null,null,null,null,null,null,null,null,112,{"$f":"'급여대장(입력)'!C99","v":0},{"$f":"_xlfn.IFNA(VLOOKUP(T118,'급여대장(입력)'!$C$6:$V$22,20,0),0)","v":0},{"$error":"#REF!"},{"$error":"#REF!"},{"$f":"IFERROR(VLOOKUP(T118,표1[[사원명]:[열3]],11,0),0)","v":0},0,{"$error":"#REF!"},{"$error":"#REF!"}]
[null,null,null,null,null,null,null,null,null,null,null,null,null,null,null,null,null,null,113,{"$f":"'급여대장(입력)'!C100","v":0},{"$f":"_xlfn.IFNA(VLOOKUP(T119,'급여대장(입력)'!$C$6:$V$22,20,0),0)","v":0},{"$error":"#REF!"},{"$error":"#REF!"},{"$f":"IFERROR(VLOOKUP(T119,표1[[사원명]:[열3]],11,0),0)","v":0},0,{"$error":"#REF!"},{"$error":"#REF!"}]
[null,null,null,null,null,null,null,null,null,null,null,null,null,null,null,null,null,null,114,{"$f":"'급여대장(입력)'!C101","v":0},{"$f":"_xlfn.IFNA(VLOOKUP(T120,'급여대장(입력)'!$C$6:$V$22,20,0),0)","v":0},{"$error":"#REF!"},{"$error":"#REF!"},{"$f":"IFERROR(VLOOKUP(T120,표1[[사원명]:[열3]],11,0),0)","v":0},0,{"$error":"#REF!"},{"$error":"#REF!"}]
[null,null,null,null,null,null,null,null,null,null,null,null,null,null,null,null,null,null,115,{"$f":"'급여대장(입력)'!C102","v":0},{"$f":"_xlfn.IFNA(VLOOKUP(T121,'급여대장(입력)'!$C$6:$V$22,20,0),0)","v":0},{"$error":"#REF!"},{"$error":"#REF!"},{"$f":"IFERROR(VLOOKUP(T121,표1[[사원명]:[열3]],11,0),0)","v":0},0,{"$error":"#REF!"},{"$error":"#REF!"}]
[null,null,null,null,null,null,null,null,null,null,null,null,null,null,null,null,null,null,116,{"$f":"'급여대장(입력)'!C103","v":0},{"$f":"_xlfn.IFNA(VLOOKUP(T122,'급여대장(입력)'!$C$6:$V$22,20,0),0)","v":0},{"$error":"#REF!"},{"$error":"#REF!"},{"$f":"IFERROR(VLOOKUP(T122,표1[[사원명]:[열3]],11,0),0)","v":0},0,{"$error":"#REF!"},{"$error":"#REF!"}]
[null,null,null,null,null,null,null,null,null,null,null,null,null,null,null,null,null,null,117,{"$f":"'급여대장(입력)'!C104","v":0},{"$f":"_xlfn.IFNA(VLOOKUP(T123,'급여대장(입력)'!$C$6:$V$22,20,0),0)","v":0},{"$error":"#REF!"},{"$error":"#REF!"},{"$f":"IFERROR(VLOOKUP(T123,표1[[사원명]:[열3]],11,0),0)","v":0},0,{"$error":"#REF!"},{"$error":"#REF!"}]
[null,null,null,null,null,null,null,null,null,null,null,null,null,null,null,null,null,null,118,{"$f":"'급여대장(입력)'!C105","v":0},{"$f":"_xlfn.IFNA(VLOOKUP(T124,'급여대장(입력)'!$C$6:$V$22,20,0),0)","v":0},{"$error":"#REF!"},{"$error":"#REF!"},{"$f":"IFERROR(VLOOKUP(T124,표1[[사원명]:[열3]],11,0),0)","v":0},0,{"$error":"#REF!"},{"$error":"#REF!"}]
[null,null,null,null,null,null,null,null,null,null,null,null,null,null,null,null,null,null,119,{"$f":"'급여대장(입력)'!C106","v":0},{"$f":"_xlfn.IFNA(VLOOKUP(T125,'급여대장(입력)'!$C$6:$V$22,20,0),0)","v":0},{"$error":"#REF!"},{"$error":"#REF!"},{"$f":"IFERROR(VLOOKUP(T125,표1[[사원명]:[열3]],11,0),0)","v":0},0,{"$error":"#REF!"},{"$error":"#REF!"}]
[null,null,null,null,null,null,null,null,null,null,null,null,null,null,null,null,null,null,120,{"$f":"'급여대장(입력)'!C107","v":0},{"$f":"_xlfn.IFNA(VLOOKUP(T126,'급여대장(입력)'!$C$6:$V$22,20,0),0)","v":0},{"$error":"#REF!"},{"$error":"#REF!"},{"$f":"IFERROR(VLOOKUP(T126,표1[[사원명]:[열3]],11,0),0)","v":0},0,{"$error":"#REF!"},{"$error":"#REF!"}]
[null,null,null,null,null,null,null,null,null,null,null,null,null,null,null,null,null,null,121,{"$f":"'급여대장(입력)'!C108","v":0},{"$f":"_xlfn.IFNA(VLOOKUP(T127,'급여대장(입력)'!$C$6:$V$22,20,0),0)","v":0},{"$error":"#REF!"},{"$error":"#REF!"},{"$f":"IFERROR(VLOOKUP(T127,표1[[사원명]:[열3]],11,0),0)","v":0},0,{"$error":"#REF!"},{"$error":"#REF!"}]
[null,null,null,null,null,null,null,null,null,null,null,null,null,null,null,null,null,null,122,{"$f":"'급여대장(입력)'!C109","v":0},{"$f":"_xlfn.IFNA(VLOOKUP(T128,'급여대장(입력)'!$C$6:$V$22,20,0),0)","v":0},{"$error":"#REF!"},{"$error":"#REF!"},{"$f":"IFERROR(VLOOKUP(T128,표1[[사원명]:[열3]],11,0),0)","v":0},0,{"$error":"#REF!"},{"$error":"#REF!"}]
[null,null,null,null,null,null,null,null,null,null,null,null,null,null,null,null,null,null,123,{"$f":"'급여대장(입력)'!C110","v":0},{"$f":"_xlfn.IFNA(VLOOKUP(T129,'급여대장(입력)'!$C$6:$V$22,20,0),0)","v":0},{"$error":"#REF!"},{"$error":"#REF!"},{"$f":"IFERROR(VLOOKUP(T129,표1[[사원명]:[열3]],11,0),0)","v":0},0,{"$error":"#REF!"},{"$error":"#REF!"}]
[null,null,null,null,null,null,null,null,null,null,null,null,null,null,null,null,null,null,124,{"$f":"'급여대장(입력)'!C111","v":0},{"$f":"_xlfn.IFNA(VLOOKUP(T130,'급여대장(입력)'!$C$6:$V$22,20,0),0)","v":0},{"$error":"#REF!"},{"$error":"#REF!"},{"$f":"IFERROR(VLOOKUP(T130,표1[[사원명]:[열3]],11,0),0)","v":0},0,{"$error":"#REF!"},{"$error":"#REF!"}]
[null,null,null,null,null,null,null,null,null,null,null,null,null,null,null,null,null,null,125,{"$f":"'급여대장(입력)'!C112","v":0},{"$f":"_xlfn.IFNA(VLOOKUP(T131,'급여대장(입력)'!$C$6:$V$22,20,0),0)","v":0},{"$error":"#REF!"},{"$error":"#REF!"},{"$f":"IFERROR(VLOOKUP(T131,표1[[사원명]:[열3]],11,0),0)","v":0},0,{"$error":"#REF!"},{"$error":"#REF!"}]
[null,null,null,null,null,null,null,null,null,null,null,null,null,null,null,null,null,null,126,{"$f":"'급여대장(입력)'!C113","v":0},{"$f":"_xlfn.IFNA(VLOOKUP(T132,'급여대장(입력)'!$C$6:$V$22,20,0),0)","v":0},{"$error":"#REF!"},{"$error":"#REF!"},{"$f":"IFERROR(VLOOKUP(T132,표1[[사원명]:[열3]],11,0),0)","v":0},0,{"$error":"#REF!"},{"$error":"#REF!"}]
[null,null,null,null,null,null,null,null,null,null,null,null,null,null,null,null,null,null,127,{"$f":"'급여대장(입력)'!C114","v":0},{"$f":"_xlfn.IFNA(VLOOKUP(T133,'급여대장(입력)'!$C$6:$V$22,20,0),0)","v":0},{"$error":"#REF!"},{"$error":"#REF!"},{"$f":"IFERROR(VLOOKUP(T133,표1[[사원명]:[열3]],11,0),0)","v":0},0,{"$error":"#REF!"},{"$error":"#REF!"}]
[null,null,null,null,null,null,null,null,null,null,null,null,null,null,null,null,null,null,128,{"$f":"'급여대장(입력)'!C115","v":0},{"$f":"_xlfn.IFNA(VLOOKUP(T134,'급여대장(입력)'!$C$6:$V$22,20,0),0)","v":0},{"$error":"#REF!"},{"$error":"#REF!"},{"$f":"IFERROR(VLOOKUP(T134,표1[[사원명]:[열3]],11,0),0)","v":0},0,{"$error":"#REF!"},{"$error":"#REF!"}]
[null,null,null,null,null,null,null,null,null,null,null,null,null,null,null,null,null,null,129,{"$f":"'급여대장(입력)'!C116","v":0},{"$f":"_xlfn.IFNA(VLOOKUP(T135,'급여대장(입력)'!$C$6:$V$22,20,0),0)","v":0},{"$error":"#REF!"},{"$error":"#REF!"},{"$f":"IFERROR(VLOOKUP(T135,표1[[사원명]:[열3]],11,0),0)","v":0},0,{"$error":"#REF!"},{"$error":"#REF!"}]
[null,null,null,null,null,null,null,null,null,null,null,null,null,null,null,null,null,null,130,{"$f":"'급여대장(입력)'!C117","v":0},{"$f":"_xlfn.IFNA(VLOOKUP(T136,'급여대장(입력)'!$C$6:$V$22,20,0),0)","v":0},{"$f":"RANK(U136,$U$7:$U$306)","v":{"$error":"#REF!"}},{"$f":"$V136+COUNTIFS($V$7:$V$306,$V136,$S$7:$S$306,\"<\"&S136)","v":{"$error":"#REF!"}},{"$f":"IFERROR(VLOOKUP(T136,표1[[사원명]:[열3]],11,0),0)","v":0},{"$f":"U136-X136","v":0},{"$f":"RANK(Y136,$Y$7:$Y$306)","v":{"$error":"#REF!"}},{"$f":"$Z136+COUNTIFS($Z$7:$Z$306,$Z136,$S$7:$S$306,\"<\"&S136)","v":{"$error":"#REF!"}}]
[null,null,null,null,null,null,null,null,null,null,null,null,null,null,null,null,null,null,131,{"$f":"'급여대장(입력)'!C118","v":0},{"$f":"_xlfn.IFNA(VLOOKUP(T137,'급여대장(입력)'!$C$6:$V$22,20,0),0)","v":0},{"$error":"#REF!"},{"$error":"#REF!"},{"$f":"IFERROR(VLOOKUP(T137,표1[[사원명]:[열3]],11,0),0)","v":0},0,{"$error":"#REF!"},{"$error":"#REF!"}]
[null,null,null,null,null,null,null,null,null,null,null,null,null,null,null,null,null,null,132,{"$f":"'급여대장(입력)'!C119","v":0},{"$f":"_xlfn.IFNA(VLOOKUP(T138,'급여대장(입력)'!$C$6:$V$22,20,0),0)","v":0},{"$error":"#REF!"},{"$error":"#REF!"},{"$f":"IFERROR(VLOOKUP(T138,표1[[사원명]:[열3]],11,0),0)","v":0},0,{"$error":"#REF!"},{"$error":"#REF!"}]
[null,null,null,null,null,null,null,null,null,null,null,null,null,null,null,null,null,null,133,{"$f":"'급여대장(입력)'!C120","v":0},{"$f":"_xlfn.IFNA(VLOOKUP(T139,'급여대장(입력)'!$C$6:$V$22,20,0),0)","v":0},{"$error":"#REF!"},{"$error":"#REF!"},{"$f":"IFERROR(VLOOKUP(T139,표1[[사원명]:[열3]],11,0),0)","v":0},0,{"$error":"#REF!"},{"$error":"#REF!"}]
[null,null,null,null,null,null,null,null,null,null,null,null,null,null,null,null,null,null,134,{"$f":"'급여대장(입력)'!C121","v":0},{"$f":"_xlfn.IFNA(VLOOKUP(T140,'급여대장(입력)'!$C$6:$V$22,20,0),0)","v":0},{"$error":"#REF!"},{"$error":"#REF!"},{"$f":"IFERROR(VLOOKUP(T140,표1[[사원명]:[열3]],11,0),0)","v":0},0,{"$error":"#REF!"},{"$error":"#REF!"}]
[null,null,null,null,null,null,null,null,null,null,null,null,null,null,null,null,null,null,135,{"$f":"'급여대장(입력)'!C122","v":0},{"$f":"_xlfn.IFNA(VLOOKUP(T141,'급여대장(입력)'!$C$6:$V$22,20,0),0)","v":0},{"$error":"#REF!"},{"$error":"#REF!"},{"$f":"IFERROR(VLOOKUP(T141,표1[[사원명]:[열3]],11,0),0)","v":0},0,{"$error":"#REF!"},{"$error":"#REF!"}]
[null,null,null,null,null,null,null,null,null,null,null,null,null,null,null,null,null,null,136,{"$f":"'급여대장(입력)'!C123","v":0},{"$f":"_xlfn.IFNA(VLOOKUP(T142,'급여대장(입력)'!$C$6:$V$22,20,0),0)","v":0},{"$error":"#REF!"},{"$error":"#REF!"},{"$f":"IFERROR(VLOOKUP(T142,표1[[사원명]:[열3]],11,0),0)","v":0},0,{"$error":"#REF!"},{"$error":"#REF!"}]
[null,null,null,null,null,null,null,null,null,null,null,null,null,null,null,null,null,null,137,{"$f":"'급여대장(입력)'!C124","v":0},{"$f":"_xlfn.IFNA(VLOOKUP(T143,'급여대장(입력)'!$C$6:$V$22,20,0),0)","v":0},{"$error":"#REF!"},{"$error":"#REF!"},{"$f":"IFERROR(VLOOKUP(T143,표1[[사원명]:[열3]],11,0),0)","v":0},0,{"$error":"#REF!"},{"$error":"#REF!"}]
[null,null,null,null,null,null,null,null,null,null,null,null,null,null,null,null,null,null,138,{"$f":"'급여대장(입력)'!C125","v":0},{"$f":"_xlfn.IFNA(VLOOKUP(T144,'급여대장(입력)'!$C$6:$V$22,20,0),0)","v":0},{"$error":"#REF!"},{"$error":"#REF!"},{"$f":"IFERROR(VLOOKUP(T144,표1[[사원명]:[열3]],11,0),0)","v":0},0,{"$error":"#REF!"},{"$error":"#REF!"}]
[null,null,null,null,null,null,null,null,null,null,null,null,null,null,null,null,null,null,139,{"$f":"'급여대장(입력)'!C126","v":0},{"$f":"_xlfn.IFNA(VLOOKUP(T145,'급여대장(입력)'!$C$6:$V$22,20,0),0)","v":0},{"$error":"#REF!"},{"$error":"#REF!"},{"$f":"IFERROR(VLOOKUP(T145,표1[[사원명]:[열3]],11,0),0)","v":0},0,{"$error":"#REF!"},{"$error":"#REF!"}]
[null,null,null,null,null,null,null,null,null,null,null,null,null,null,null,null,null,null,140,{"$f":"'급여대장(입력)'!C127","v":0},{"$f":"_xlfn.IFNA(VLOOKUP(T146,'급여대장(입력)'!$C$6:$V$22,20,0),0)","v":0},{"$error":"#REF!"},{"$error":"#REF!"},{"$f":"IFERROR(VLOOKUP(T146,표1[[사원명]:[열3]],11,0),0)","v":0},0,{"$error":"#REF!"},{"$error":"#REF!"}]
[null,null,null,null,null,null,null,null,null,null,null,null,null,null,null,null,null,null,141,{"$f":"'급여대장(입력)'!C128","v":0},{"$f":"_xlfn.IFNA(VLOOKUP(T147,'급여대장(입력)'!$C$6:$V$22,20,0),0)","v":0},{"$error":"#REF!"},{"$error":"#REF!"},{"$f":"IFERROR(VLOOKUP(T147,표1[[사원명]:[열3]],11,0),0)","v":0},0,{"$error":"#REF!"},{"$error":"#REF!"}]
[null,null,null,null,null,null,null,null,null,null,null,null,null,null,null,null,null,null,142,{"$f":"'급여대장(입력)'!C129","v":0},{"$f":"_xlfn.IFNA(VLOOKUP(T148,'급여대장(입력)'!$C$6:$V$22,20,0),0)","v":0},{"$error":"#REF!"},{"$error":"#REF!"},{"$f":"IFERROR(VLOOKUP(T148,표1[[사원명]:[열3]],11,0),0)","v":0},0,{"$error":"#REF!"},{"$error":"#REF!"}]
[null,null,null,null,null,null,null,null,null,null,null,null,null,null,null,null,null,null,143,{"$f":"'급여대장(입력)'!C130","v":0},{"$f":"_xlfn.IFNA(VLOOKUP(T149,'급여대장(입력)'!$C$6:$V$22,20,0),0)","v":0},{"$error":"#REF!"},{"$error":"#REF!"},{"$f":"IFERROR(VLOOKUP(T149,표1[[사원명]:[열3]],11,0),0)","v":0},0,{"$error":"#REF!"},{"$error":"#REF!"}]
[null,null,null,null,null,null,null,null,null,null,null,null,null,null,null,null,null,null,144,{"$f":"'급여대장(입력)'!C131","v":0},{"$f":"_xlfn.IFNA(VLOOKUP(T150,'급여대장(입력)'!$C$6:$V$22,20,0),0)","v":0},{"$error":"#REF!"},{"$error":"#REF!"},{"$f":"IFERROR(VLOOKUP(T150,표1[[사원명]:[열3]],11,0),0)","v":0},0,{"$error":"#REF!"},{"$error":"#REF!"}]
[null,null,null,null,null,null,null,null,null,null,null,null,null,null,null,null,null,null,145,{"$f":"'급여대장(입력)'!C132","v":0},{"$f":"_xlfn.IFNA(VLOOKUP(T151,'급여대장(입력)'!$C$6:$V$22,20,0),0)","v":0},{"$error":"#REF!"},{"$error":"#REF!"},{"$f":"IFERROR(VLOOKUP(T151,표1[[사원명]:[열3]],11,0),0)","v":0},0,{"$error":"#REF!"},{"$error":"#REF!"}]
[null,null,null,null,null,null,null,null,null,null,null,null,null,null,null,null,null,null,146,{"$f":"'급여대장(입력)'!C133","v":0},{"$f":"_xlfn.IFNA(VLOOKUP(T152,'급여대장(입력)'!$C$6:$V$22,20,0),0)","v":0},{"$error":"#REF!"},{"$error":"#REF!"},{"$f":"IFERROR(VLOOKUP(T152,표1[[사원명]:[열3]],11,0),0)","v":0},0,{"$error":"#REF!"},{"$error":"#REF!"}]
[null,null,null,null,null,null,null,null,null,null,null,null,null,null,null,null,null,null,147,{"$f":"'급여대장(입력)'!C134","v":0},{"$f":"_xlfn.IFNA(VLOOKUP(T153,'급여대장(입력)'!$C$6:$V$22,20,0),0)","v":0},{"$error":"#REF!"},{"$error":"#REF!"},{"$f":"IFERROR(VLOOKUP(T153,표1[[사원명]:[열3]],11,0),0)","v":0},0,{"$error":"#REF!"},{"$error":"#REF!"}]
[null,null,null,null,null,null,null,null,null,null,null,null,null,null,null,null,null,null,148,{"$f":"'급여대장(입력)'!C135","v":0},{"$f":"_xlfn.IFNA(VLOOKUP(T154,'급여대장(입력)'!$C$6:$V$22,20,0),0)","v":0},{"$error":"#REF!"},{"$error":"#REF!"},{"$f":"IFERROR(VLOOKUP(T154,표1[[사원명]:[열3]],11,0),0)","v":0},0,{"$error":"#REF!"},{"$error":"#REF!"}]
[null,null,null,null,null,null,null,null,null,null,null,null,null,null,null,null,null,null,149,{"$f":"'급여대장(입력)'!C136","v":0},{"$f":"_xlfn.IFNA(VLOOKUP(T155,'급여대장(입력)'!$C$6:$V$22,20,0),0)","v":0},{"$error":"#REF!"},{"$error":"#REF!"},{"$f":"IFERROR(VLOOKUP(T155,표1[[사원명]:[열3]],11,0),0)","v":0},0,{"$error":"#REF!"},{"$error":"#REF!"}]
[null,null,null,null,null,null,null,null,null,null,null,null,null,null,null,null,null,null,150,{"$f":"'급여대장(입력)'!C137","v":0},{"$f":"_xlfn.IFNA(VLOOKUP(T156,'급여대장(입력)'!$C$6:$V$22,20,0),0)","v":0},{"$error":"#REF!"},{"$error":"#REF!"},{"$f":"IFERROR(VLOOKUP(T156,표1[[사원명]:[열3]],11,0),0)","v":0},0,{"$error":"#REF!"},{"$error":"#REF!"}]
[null,null,null,null,null,null,null,null,null,null,null,null,null,null,null,null,null,null,151,{"$f":"'급여대장(입력)'!C138","v":0},{"$f":"_xlfn.IFNA(VLOOKUP(T157,'급여대장(입력)'!$C$6:$V$22,20,0),0)","v":0},{"$error":"#REF!"},{"$error":"#REF!"},{"$f":"IFERROR(VLOOKUP(T157,표1[[사원명]:[열3]],11,0),0)","v":0},0,{"$error":"#REF!"},{"$error":"#REF!"}]
[null,null,null,null,null,null,null,null,null,null,null,null,null,null,null,null,null,null,152,{"$f":"'급여대장(입력)'!C139","v":0},{"$f":"_xlfn.IFNA(VLOOKUP(T158,'급여대장(입력)'!$C$6:$V$22,20,0),0)","v":0},{"$error":"#REF!"},{"$error":"#REF!"},{"$f":"IFERROR(VLOOKUP(T158,표1[[사원명]:[열3]],11,0),0)","v":0},0,{"$error":"#REF!"},{"$error":"#REF!"}]
[null,null,null,null,null,null,null,null,null,null,null,null,null,null,null,null,null,null,153,{"$f":"'급여대장(입력)'!C140","v":0},{"$f":"_xlfn.IFNA(VLOOKUP(T159,'급여대장(입력)'!$C$6:$V$22,20,0),0)","v":0},{"$error":"#REF!"},{"$error":"#REF!"},{"$f":"IFERROR(VLOOKUP(T159,표1[[사원명]:[열3]],11,0),0)","v":0},0,{"$error":"#REF!"},{"$error":"#REF!"}]
[null,null,null,null,null,null,null,null,null,null,null,null,null,null,null,null,null,null,154,{"$f":"'급여대장(입력)'!C141","v":0},{"$f":"_xlfn.IFNA(VLOOKUP(T160,'급여대장(입력)'!$C$6:$V$22,20,0),0)","v":0},{"$error":"#REF!"},{"$error":"#REF!"},{"$f":"IFERROR(VLOOKUP(T160,표1[[사원명]:[열3]],11,0),0)","v":0},0,{"$error":"#REF!"},{"$error":"#REF!"}]
[null,null,null,null,null,null,null,null,null,null,null,null,null,null,null,null,null,null,155,{"$f":"'급여대장(입력)'!C142","v":0},{"$f":"_xlfn.IFNA(VLOOKUP(T161,'급여대장(입력)'!$C$6:$V$22,20,0),0)","v":0},{"$error":"#REF!"},{"$error":"#REF!"},{"$f":"IFERROR(VLOOKUP(T161,표1[[사원명]:[열3]],11,0),0)","v":0},0,{"$error":"#REF!"},{"$error":"#REF!"}]
[null,null,null,null,null,null,null,null,null,null,null,null,null,null,null,null,null,null,156,{"$f":"'급여대장(입력)'!C143","v":0},{"$f":"_xlfn.IFNA(VLOOKUP(T162,'급여대장(입력)'!$C$6:$V$22,20,0),0)","v":0},{"$error":"#REF!"},{"$error":"#REF!"},{"$f":"IFERROR(VLOOKUP(T162,표1[[사원명]:[열3]],11,0),0)","v":0},0,{"$error":"#REF!"},{"$error":"#REF!"}]
[null,null,null,null,null,null,null,null,null,null,null,null,null,null,null,null,null,null,157,{"$f":"'급여대장(입력)'!C144","v":0},{"$f":"_xlfn.IFNA(VLOOKUP(T163,'급여대장(입력)'!$C$6:$V$22,20,0),0)","v":0},{"$error":"#REF!"},{"$error":"#REF!"},{"$f":"IFERROR(VLOOKUP(T163,표1[[사원명]:[열3]],11,0),0)","v":0},0,{"$error":"#REF!"},{"$error":"#REF!"}]
[null,null,null,null,null,null,null,null,null,null,null,null,null,null,null,null,null,null,158,{"$f":"'급여대장(입력)'!C145","v":0},{"$f":"_xlfn.IFNA(VLOOKUP(T164,'급여대장(입력)'!$C$6:$V$22,20,0),0)","v":0},{"$error":"#REF!"},{"$error":"#REF!"},{"$f":"IFERROR(VLOOKUP(T164,표1[[사원명]:[열3]],11,0),0)","v":0},0,{"$error":"#REF!"},{"$error":"#REF!"}]
[null,null,null,null,null,null,null,null,null,null,null,null,null,null,null,null,null,null,159,{"$f":"'급여대장(입력)'!C146","v":0},{"$f":"_xlfn.IFNA(VLOOKUP(T165,'급여대장(입력)'!$C$6:$V$22,20,0),0)","v":0},{"$error":"#REF!"},{"$error":"#REF!"},{"$f":"IFERROR(VLOOKUP(T165,표1[[사원명]:[열3]],11,0),0)","v":0},0,{"$error":"#REF!"},{"$error":"#REF!"}]
[null,null,null,null,null,null,null,null,null,null,null,null,null,null,null,null,null,null,160,{"$f":"'급여대장(입력)'!C147","v":0},{"$f":"_xlfn.IFNA(VLOOKUP(T166,'급여대장(입력)'!$C$6:$V$22,20,0),0)","v":0},{"$error":"#REF!"},{"$error":"#REF!"},{"$f":"IFERROR(VLOOKUP(T166,표1[[사원명]:[열3]],11,0),0)","v":0},0,{"$error":"#REF!"},{"$error":"#REF!"}]
[null,null,null,null,null,null,null,null,null,null,null,null,null,null,null,null,null,null,161,{"$f":"'급여대장(입력)'!C148","v":0},{"$f":"_xlfn.IFNA(VLOOKUP(T167,'급여대장(입력)'!$C$6:$V$22,20,0),0)","v":0},{"$error":"#REF!"},{"$error":"#REF!"},{"$f":"IFERROR(VLOOKUP(T167,표1[[사원명]:[열3]],11,0),0)","v":0},0,{"$error":"#REF!"},{"$error":"#REF!"}]
[null,null,null,null,null,null,null,null,null,null,null,null,null,null,null,null,null,null,162,{"$f":"'급여대장(입력)'!C149","v":0},{"$f":"_xlfn.IFNA(VLOOKUP(T168,'급여대장(입력)'!$C$6:$V$22,20,0),0)","v":0},{"$error":"#REF!"},{"$error":"#REF!"},{"$f":"IFERROR(VLOOKUP(T168,표1[[사원명]:[열3]],11,0),0)","v":0},0,{"$error":"#REF!"},{"$error":"#REF!"}]
[null,null,null,null,null,null,null,null,null,null,null,null,null,null,null,null,null,null,163,{"$f":"'급여대장(입력)'!C150","v":0},{"$f":"_xlfn.IFNA(VLOOKUP(T169,'급여대장(입력)'!$C$6:$V$22,20,0),0)","v":0},{"$error":"#REF!"},{"$error":"#REF!"},{"$f":"IFERROR(VLOOKUP(T169,표1[[사원명]:[열3]],11,0),0)","v":0},0,{"$error":"#REF!"},{"$error":"#REF!"}]
[null,null,null,null,null,null,null,null,null,null,null,null,null,null,null,null,null,null,164,{"$f":"'급여대장(입력)'!C151","v":0},{"$f":"_xlfn.IFNA(VLOOKUP(T170,'급여대장(입력)'!$C$6:$V$22,20,0),0)","v":0},{"$error":"#REF!"},{"$error":"#REF!"},{"$f":"IFERROR(VLOOKUP(T170,표1[[사원명]:[열3]],11,0),0)","v":0},0,{"$error":"#REF!"},{"$error":"#REF!"}]
[null,null,null,null,null,null,null,null,null,null,null,null,null,null,null,null,null,null,165,{"$f":"'급여대장(입력)'!C152","v":0},{"$f":"_xlfn.IFNA(VLOOKUP(T171,'급여대장(입력)'!$C$6:$V$22,20,0),0)","v":0},{"$error":"#REF!"},{"$error":"#REF!"},{"$f":"IFERROR(VLOOKUP(T171,표1[[사원명]:[열3]],11,0),0)","v":0},0,{"$error":"#REF!"},{"$error":"#REF!"}]
[null,null,null,null,null,null,null,null,null,null,null,null,null,null,null,null,null,null,166,{"$f":"'급여대장(입력)'!C153","v":0},{"$f":"_xlfn.IFNA(VLOOKUP(T172,'급여대장(입력)'!$C$6:$V$22,20,0),0)","v":0},{"$error":"#REF!"},{"$error":"#REF!"},{"$f":"IFERROR(VLOOKUP(T172,표1[[사원명]:[열3]],11,0),0)","v":0},0,{"$error":"#REF!"},{"$error":"#REF!"}]
[null,null,null,null,null,null,null,null,null,null,null,null,null,null,null,null,null,null,167,{"$f":"'급여대장(입력)'!C154","v":0},{"$f":"_xlfn.IFNA(VLOOKUP(T173,'급여대장(입력)'!$C$6:$V$22,20,0),0)","v":0},{"$error":"#REF!"},{"$error":"#REF!"},{"$f":"IFERROR(VLOOKUP(T173,표1[[사원명]:[열3]],11,0),0)","v":0},0,{"$error":"#REF!"},{"$error":"#REF!"}]
[null,null,null,null,null,null,null,null,null,null,null,null,null,null,null,null,null,null,168,{"$f":"'급여대장(입력)'!C155","v":0},{"$f":"_xlfn.IFNA(VLOOKUP(T174,'급여대장(입력)'!$C$6:$V$22,20,0),0)","v":0},{"$error":"#REF!"},{"$error":"#REF!"},{"$f":"IFERROR(VLOOKUP(T174,표1[[사원명]:[열3]],11,0),0)","v":0},0,{"$error":"#REF!"},{"$error":"#REF!"}]
[null,null,null,null,null,null,null,null,null,null,null,null,null,null,null,null,null,null,169,{"$f":"'급여대장(입력)'!C156","v":0},{"$f":"_xlfn.IFNA(VLOOKUP(T175,'급여대장(입력)'!$C$6:$V$22,20,0),0)","v":0},{"$error":"#REF!"},{"$error":"#REF!"},{"$f":"IFERROR(VLOOKUP(T175,표1[[사원명]:[열3]],11,0),0)","v":0},0,{"$error":"#REF!"},{"$error":"#REF!"}]
[null,null,null,null,null,null,null,null,null,null,null,null,null,null,null,null,null,null,170,{"$f":"'급여대장(입력)'!C157","v":0},{"$f":"_xlfn.IFNA(VLOOKUP(T176,'급여대장(입력)'!$C$6:$V$22,20,0),0)","v":0},{"$error":"#REF!"},{"$error":"#REF!"},{"$f":"IFERROR(VLOOKUP(T176,표1[[사원명]:[열3]],11,0),0)","v":0},0,{"$error":"#REF!"},{"$error":"#REF!"}]
[null,null,null,null,null,null,null,null,null,null,null,null,null,null,null,null,null,null,171,{"$f":"'급여대장(입력)'!C158","v":0},{"$f":"_xlfn.IFNA(VLOOKUP(T177,'급여대장(입력)'!$C$6:$V$22,20,0),0)","v":0},{"$error":"#REF!"},{"$error":"#REF!"},{"$f":"IFERROR(VLOOKUP(T177,표1[[사원명]:[열3]],11,0),0)","v":0},0,{"$error":"#REF!"},{"$error":"#REF!"}]
[null,null,null,null,null,null,null,null,null,null,null,null,null,null,null,null,null,null,172,{"$f":"'급여대장(입력)'!C159","v":0},{"$f":"_xlfn.IFNA(VLOOKUP(T178,'급여대장(입력)'!$C$6:$V$22,20,0),0)","v":0},{"$error":"#REF!"},{"$error":"#REF!"},{"$f":"IFERROR(VLOOKUP(T178,표1[[사원명]:[열3]],11,0),0)","v":0},0,{"$error":"#REF!"},{"$error":"#REF!"}]
[null,null,null,null,null,null,null,null,null,null,null,null,null,null,null,null,null,null,173,{"$f":"'급여대장(입력)'!C160","v":0},{"$f":"_xlfn.IFNA(VLOOKUP(T179,'급여대장(입력)'!$C$6:$V$22,20,0),0)","v":0},{"$error":"#REF!"},{"$error":"#REF!"},{"$f":"IFERROR(VLOOKUP(T179,표1[[사원명]:[열3]],11,0),0)","v":0},0,{"$error":"#REF!"},{"$error":"#REF!"}]
[null,null,null,null,null,null,null,null,null,null,null,null,null,null,null,null,null,null,174,{"$f":"'급여대장(입력)'!C161","v":0},{"$f":"_xlfn.IFNA(VLOOKUP(T180,'급여대장(입력)'!$C$6:$V$22,20,0),0)","v":0},{"$error":"#REF!"},{"$error":"#REF!"},{"$f":"IFERROR(VLOOKUP(T180,표1[[사원명]:[열3]],11,0),0)","v":0},0,{"$error":"#REF!"},{"$error":"#REF!"}]
[null,null,null,null,null,null,null,null,null,null,null,null,null,null,null,null,null,null,175,{"$f":"'급여대장(입력)'!C162","v":0},{"$f":"_xlfn.IFNA(VLOOKUP(T181,'급여대장(입력)'!$C$6:$V$22,20,0),0)","v":0},{"$error":"#REF!"},{"$error":"#REF!"},{"$f":"IFERROR(VLOOKUP(T181,표1[[사원명]:[열3]],11,0),0)","v":0},0,{"$error":"#REF!"},{"$error":"#REF!"}]
[null,null,null,null,null,null,null,null,null,null,null,null,null,null,null,null,null,null,176,{"$f":"'급여대장(입력)'!C163","v":0},{"$f":"_xlfn.IFNA(VLOOKUP(T182,'급여대장(입력)'!$C$6:$V$22,20,0),0)","v":0},{"$error":"#REF!"},{"$error":"#REF!"},{"$f":"IFERROR(VLOOKUP(T182,표1[[사원명]:[열3]],11,0),0)","v":0},0,{"$error":"#REF!"},{"$error":"#REF!"}]
[null,null,null,null,null,null,null,null,null,null,null,null,null,null,null,null,null,null,177,{"$f":"'급여대장(입력)'!C164","v":0},{"$f":"_xlfn.IFNA(VLOOKUP(T183,'급여대장(입력)'!$C$6:$V$22,20,0),0)","v":0},{"$error":"#REF!"},{"$error":"#REF!"},{"$f":"IFERROR(VLOOKUP(T183,표1[[사원명]:[열3]],11,0),0)","v":0},0,{"$error":"#REF!"},{"$error":"#REF!"}]
[null,null,null,null,null,null,null,null,null,null,null,null,null,null,null,null,null,null,178,{"$f":"'급여대장(입력)'!C165","v":0},{"$f":"_xlfn.IFNA(VLOOKUP(T184,'급여대장(입력)'!$C$6:$V$22,20,0),0)","v":0},{"$error":"#REF!"},{"$error":"#REF!"},{"$f":"IFERROR(VLOOKUP(T184,표1[[사원명]:[열3]],11,0),0)","v":0},0,{"$error":"#REF!"},{"$error":"#REF!"}]
[null,null,null,null,null,null,null,null,null,null,null,null,null,null,null,null,null,null,179,{"$f":"'급여대장(입력)'!C166","v":0},{"$f":"_xlfn.IFNA(VLOOKUP(T185,'급여대장(입력)'!$C$6:$V$22,20,0),0)","v":0},{"$error":"#REF!"},{"$error":"#REF!"},{"$f":"IFERROR(VLOOKUP(T185,표1[[사원명]:[열3]],11,0),0)","v":0},0,{"$error":"#REF!"},{"$error":"#REF!"}]
[null,null,null,null,null,null,null,null,null,null,null,null,null,null,null,null,null,null,180,{"$f":"'급여대장(입력)'!C167","v":0},{"$f":"_xlfn.IFNA(VLOOKUP(T186,'급여대장(입력)'!$C$6:$V$22,20,0),0)","v":0},{"$error":"#REF!"},{"$error":"#REF!"},{"$f":"IFERROR(VLOOKUP(T186,표1[[사원명]:[열3]],11,0),0)","v":0},0,{"$error":"#REF!"},{"$error":"#REF!"}]
[null,null,null,null,null,null,null,null,null,null,null,null,null,null,null,null,null,null,181,{"$f":"'급여대장(입력)'!C168","v":0},{"$f":"_xlfn.IFNA(VLOOKUP(T187,'급여대장(입력)'!$C$6:$V$22,20,0),0)","v":0},{"$error":"#REF!"},{"$error":"#REF!"},{"$f":"IFERROR(VLOOKUP(T187,표1[[사원명]:[열3]],11,0),0)","v":0},0,{"$error":"#REF!"},{"$error":"#REF!"}]
[null,null,null,null,null,null,null,null,null,null,null,null,null,null,null,null,null,null,182,{"$f":"'급여대장(입력)'!C169","v":0},{"$f":"_xlfn.IFNA(VLOOKUP(T188,'급여대장(입력)'!$C$6:$V$22,20,0),0)","v":0},{"$error":"#REF!"},{"$error":"#REF!"},{"$f":"IFERROR(VLOOKUP(T188,표1[[사원명]:[열3]],11,0),0)","v":0},0,{"$error":"#REF!"},{"$error":"#REF!"}]
[null,null,null,null,null,null,null,null,null,null,null,null,null,null,null,null,null,null,183,{"$f":"'급여대장(입력)'!C170","v":0},{"$f":"_xlfn.IFNA(VLOOKUP(T189,'급여대장(입력)'!$C$6:$V$22,20,0),0)","v":0},{"$error":"#REF!"},{"$error":"#REF!"},{"$f":"IFERROR(VLOOKUP(T189,표1[[사원명]:[열3]],11,0),0)","v":0},0,{"$error":"#REF!"},{"$error":"#REF!"}]
[null,null,null,null,null,null,null,null,null,null,null,null,null,null,null,null,null,null,184,{"$f":"'급여대장(입력)'!C171","v":0},{"$f":"_xlfn.IFNA(VLOOKUP(T190,'급여대장(입력)'!$C$6:$V$22,20,0),0)","v":0},{"$error":"#REF!"},{"$error":"#REF!"},{"$f":"IFERROR(VLOOKUP(T190,표1[[사원명]:[열3]],11,0),0)","v":0},0,{"$error":"#REF!"},{"$error":"#REF!"}]
[null,null,null,null,null,null,null,null,null,null,null,null,null,null,null,null,null,null,185,{"$f":"'급여대장(입력)'!C172","v":0},{"$f":"_xlfn.IFNA(VLOOKUP(T191,'급여대장(입력)'!$C$6:$V$22,20,0),0)","v":0},{"$error":"#REF!"},{"$error":"#REF!"},{"$f":"IFERROR(VLOOKUP(T191,표1[[사원명]:[열3]],11,0),0)","v":0},0,{"$error":"#REF!"},{"$error":"#REF!"}]
[null,null,null,null,null,null,null,null,null,null,null,null,null,null,null,null,null,null,186,{"$f":"'급여대장(입력)'!C173","v":0},{"$f":"_xlfn.IFNA(VLOOKUP(T192,'급여대장(입력)'!$C$6:$V$22,20,0),0)","v":0},{"$error":"#REF!"},{"$error":"#REF!"},{"$f":"IFERROR(VLOOKUP(T192,표1[[사원명]:[열3]],11,0),0)","v":0},0,{"$error":"#REF!"},{"$error":"#REF!"}]
[null,null,null,null,null,null,null,null,null,null,null,null,null,null,null,null,null,null,187,{"$f":"'급여대장(입력)'!C174","v":0},{"$f":"_xlfn.IFNA(VLOOKUP(T193,'급여대장(입력)'!$C$6:$V$22,20,0),0)","v":0},{"$error":"#REF!"},{"$error":"#REF!"},{"$f":"IFERROR(VLOOKUP(T193,표1[[사원명]:[열3]],11,0),0)","v":0},0,{"$error":"#REF!"},{"$error":"#REF!"}]
[null,null,null,null,null,null,null,null,null,null,null,null,null,null,null,null,null,null,188,{"$f":"'급여대장(입력)'!C175","v":0},{"$f":"_xlfn.IFNA(VLOOKUP(T194,'급여대장(입력)'!$C$6:$V$22,20,0),0)","v":0},{"$error":"#REF!"},{"$error":"#REF!"},{"$f":"IFERROR(VLOOKUP(T194,표1[[사원명]:[열3]],11,0),0)","v":0},0,{"$error":"#REF!"},{"$error":"#REF!"}]
[null,null,null,null,null,null,null,null,null,null,null,null,null,null,null,null,null,null,189,{"$f":"'급여대장(입력)'!C176","v":0},{"$f":"_xlfn.IFNA(VLOOKUP(T195,'급여대장(입력)'!$C$6:$V$22,20,0),0)","v":0},{"$error":"#REF!"},{"$error":"#REF!"},{"$f":"IFERROR(VLOOKUP(T195,표1[[사원명]:[열3]],11,0),0)","v":0},0,{"$error":"#REF!"},{"$error":"#REF!"}]
[null,null,null,null,null,null,null,null,null,null,null,null,null,null,null,null,null,null,190,{"$f":"'급여대장(입력)'!C177","v":0},{"$f":"_xlfn.IFNA(VLOOKUP(T196,'급여대장(입력)'!$C$6:$V$22,20,0),0)","v":0},{"$error":"#REF!"},{"$error":"#REF!"},{"$f":"IFERROR(VLOOKUP(T196,표1[[사원명]:[열3]],11,0),0)","v":0},0,{"$error":"#REF!"},{"$error":"#REF!"}]
[null,null,null,null,null,null,null,null,null,null,null,null,null,null,null,null,null,null,191,{"$f":"'급여대장(입력)'!C178","v":0},{"$f":"_xlfn.IFNA(VLOOKUP(T197,'급여대장(입력)'!$C$6:$V$22,20,0),0)","v":0},{"$error":"#REF!"},{"$error":"#REF!"},{"$f":"IFERROR(VLOOKUP(T197,표1[[사원명]:[열3]],11,0),0)","v":0},0,{"$error":"#REF!"},{"$error":"#REF!"}]
[null,null,null,null,null,null,null,null,null,null,null,null,null,null,null,null,null,null,192,{"$f":"'급여대장(입력)'!C179","v":0},{"$f":"_xlfn.IFNA(VLOOKUP(T198,'급여대장(입력)'!$C$6:$V$22,20,0),0)","v":0},{"$error":"#REF!"},{"$error":"#REF!"},{"$f":"IFERROR(VLOOKUP(T198,표1[[사원명]:[열3]],11,0),0)","v":0},0,{"$error":"#REF!"},{"$error":"#REF!"}]
[null,null,null,null,null,null,null,null,null,null,null,null,null,null,null,null,null,null,193,{"$f":"'급여대장(입력)'!C180","v":0},{"$f":"_xlfn.IFNA(VLOOKUP(T199,'급여대장(입력)'!$C$6:$V$22,20,0),0)","v":0},{"$error":"#REF!"},{"$error":"#REF!"},{"$f":"IFERROR(VLOOKUP(T199,표1[[사원명]:[열3]],11,0),0)","v":0},0,{"$error":"#REF!"},{"$error":"#REF!"}]
[null,null,null,null,null,null,null,null,null,null,null,null,null,null,null,null,null,null,194,{"$f":"'급여대장(입력)'!C181","v":0},{"$f":"_xlfn.IFNA(VLOOKUP(T200,'급여대장(입력)'!$C$6:$V$22,20,0),0)","v":0},{"$f":"RANK(U200,$U$7:$U$306)","v":{"$error":"#REF!"}},{"$f":"$V200+COUNTIFS($V$7:$V$306,$V200,$S$7:$S$306,\"<\"&S200)","v":{"$error":"#REF!"}},{"$f":"IFERROR(VLOOKUP(T200,표1[[사원명]:[열3]],11,0),0)","v":0},{"$f":"U200-X200","v":0},{"$f":"RANK(Y200,$Y$7:$Y$306)","v":{"$error":"#REF!"}},{"$f":"$Z200+COUNTIFS($Z$7:$Z$306,$Z200,$S$7:$S$306,\"<\"&S200)","v":{"$error":"#REF!"}}]
[null,null,null,null,null,null,null,null,null,null,null,null,null,null,null,null,null,null,195,{"$f":"'급여대장(입력)'!C182","v":0},{"$f":"_xlfn.IFNA(VLOOKUP(T201,'급여대장(입력)'!$C$6:$V$22,20,0),0)","v":0},{"$error":"#REF!"},{"$error":"#REF!"},{"$f":"IFERROR(VLOOKUP(T201,표1[[사원명]:[열3]],11,0),0)","v":0},0,{"$error":"#REF!"},{"$error":"#REF!"}]
[null,null,null,null,null,null,null,null,null,null,null,null,null,null,null,null,null,null,196,{"$f":"'급여대장(입력)'!C183","v":0},{"$f":"_xlfn.IFNA(VLOOKUP(T202,'급여대장(입력)'!$C$6:$V$22,20,0),0)","v":0},{"$error":"#REF!"},{"$error":"#REF!"},{"$f":"IFERROR(VLOOKUP(T202,표1[[사원명]:[열3]],11,0),0)","v":0},0,{"$error":"#REF!"},{"$error":"#REF!"}]
[null,null,null,null,null,null,null,null,null,null,null,null,null,null,null,null,null,null,197,{"$f":"'급여대장(입력)'!C184","v":0},{"$f":"_xlfn.IFNA(VLOOKUP(T203,'급여대장(입력)'!$C$6:$V$22,20,0),0)","v":0},{"$error":"#REF!"},{"$error":"#REF!"},{"$f":"IFERROR(VLOOKUP(T203,표1[[사원명]:[열3]],11,0),0)","v":0},0,{"$error":"#REF!"},{"$error":"#REF!"}]
[null,null,null,null,null,null,null,null,null,null,null,null,null,null,null,null,null,null,198,{"$f":"'급여대장(입력)'!C185","v":0},{"$f":"_xlfn.IFNA(VLOOKUP(T204,'급여대장(입력)'!$C$6:$V$22,20,0),0)","v":0},{"$error":"#REF!"},{"$error":"#REF!"},{"$f":"IFERROR(VLOOKUP(T204,표1[[사원명]:[열3]],11,0),0)","v":0},0,{"$error":"#REF!"},{"$error":"#REF!"}]
[null,null,null,null,null,null,null,null,null,null,null,null,null,null,null,null,null,null,199,{"$f":"'급여대장(입력)'!C186","v":0},{"$f":"_xlfn.IFNA(VLOOKUP(T205,'급여대장(입력)'!$C$6:$V$22,20,0),0)","v":0},{"$error":"#REF!"},{"$error":"#REF!"},{"$f":"IFERROR(VLOOKUP(T205,표1[[사원명]:[열3]],11,0),0)","v":0},0,{"$error":"#REF!"},{"$error":"#REF!"}]
[null,null,null,null,null,null,null,null,null,null,null,null,null,null,null,null,null,null,200,{"$f":"'급여대장(입력)'!C187","v":0},{"$f":"_xlfn.IFNA(VLOOKUP(T206,'급여대장(입력)'!$C$6:$V$22,20,0),0)","v":0},{"$error":"#REF!"},{"$error":"#REF!"},{"$f":"IFERROR(VLOOKUP(T206,표1[[사원명]:[열3]],11,0),0)","v":0},0,{"$error":"#REF!"},{"$error":"#REF!"}]
[null,null,null,null,null,null,null,null,null,null,null,null,null,null,null,null,null,null,201,{"$f":"'급여대장(입력)'!C188","v":0},{"$f":"_xlfn.IFNA(VLOOKUP(T207,'급여대장(입력)'!$C$6:$V$22,20,0),0)","v":0},{"$error":"#REF!"},{"$error":"#REF!"},{"$f":"IFERROR(VLOOKUP(T207,표1[[사원명]:[열3]],11,0),0)","v":0},0,{"$error":"#REF!"},{"$error":"#REF!"}]
[null,null,null,null,null,null,null,null,null,null,null,null,null,null,null,null,null,null,202,{"$f":"'급여대장(입력)'!C189","v":0},{"$f":"_xlfn.IFNA(VLOOKUP(T208,'급여대장(입력)'!$C$6:$V$22,20,0),0)","v":0},{"$error":"#REF!"},{"$error":"#REF!"},{"$f":"IFERROR(VLOOKUP(T208,표1[[사원명]:[열3]],11,0),0)","v":0},0,{"$error":"#REF!"},{"$error":"#REF!"}]
[null,null,null,null,null,null,null,null,null,null,null,null,null,null,null,null,null,null,203,{"$f":"'급여대장(입력)'!C190","v":0},{"$f":"_xlfn.IFNA(VLOOKUP(T209,'급여대장(입력)'!$C$6:$V$22,20,0),0)","v":0},{"$error":"#REF!"},{"$error":"#REF!"},{"$f":"IFERROR(VLOOKUP(T209,표1[[사원명]:[열3]],11,0),0)","v":0},0,{"$error":"#REF!"},{"$error":"#REF!"}]
[null,null,null,null,null,null,null,null,null,null,null,null,null,null,null,null,null,null,204,{"$f":"'급여대장(입력)'!C191","v":0},{"$f":"_xlfn.IFNA(VLOOKUP(T210,'급여대장(입력)'!$C$6:$V$22,20,0),0)","v":0},{"$error":"#REF!"},{"$error":"#REF!"},{"$f":"IFERROR(VLOOKUP(T210,표1[[사원명]:[열3]],11,0),0)","v":0},0,{"$error":"#REF!"},{"$error":"#REF!"}]
[null,null,null,null,null,null,null,null,null,null,null,null,null,null,null,null,null,null,205,{"$f":"'급여대장(입력)'!C192","v":0},{"$f":"_xlfn.IFNA(VLOOKUP(T211,'급여대장(입력)'!$C$6:$V$22,20,0),0)","v":0},{"$error":"#REF!"},{"$error":"#REF!"},{"$f":"IFERROR(VLOOKUP(T211,표1[[사원명]:[열3]],11,0),0)","v":0},0,{"$error":"#REF!"},{"$error":"#REF!"}]
[null,null,null,null,null,null,null,null,null,null,null,null,null,null,null,null,null,null,206,{"$f":"'급여대장(입력)'!C193","v":0},{"$f":"_xlfn.IFNA(VLOOKUP(T212,'급여대장(입력)'!$C$6:$V$22,20,0),0)","v":0},{"$error":"#REF!"},{"$error":"#REF!"},{"$f":"IFERROR(VLOOKUP(T212,표1[[사원명]:[열3]],11,0),0)","v":0},0,{"$error":"#REF!"},{"$error":"#REF!"}]
[null,null,null,null,null,null,null,null,null,null,null,null,null,null,null,null,null,null,207,{"$f":"'급여대장(입력)'!C194","v":0},{"$f":"_xlfn.IFNA(VLOOKUP(T213,'급여대장(입력)'!$C$6:$V$22,20,0),0)","v":0},{"$error":"#REF!"},{"$error":"#REF!"},{"$f":"IFERROR(VLOOKUP(T213,표1[[사원명]:[열3]],11,0),0)","v":0},0,{"$error":"#REF!"},{"$error":"#REF!"}]
[null,null,null,null,null,null,null,null,null,null,null,null,null,null,null,null,null,null,208,{"$f":"'급여대장(입력)'!C195","v":0},{"$f":"_xlfn.IFNA(VLOOKUP(T214,'급여대장(입력)'!$C$6:$V$22,20,0),0)","v":0},{"$error":"#REF!"},{"$error":"#REF!"},{"$f":"IFERROR(VLOOKUP(T214,표1[[사원명]:[열3]],11,0),0)","v":0},0,{"$error":"#REF!"},{"$error":"#REF!"}]
[null,null,null,null,null,null,null,null,null,null,null,null,null,null,null,null,null,null,209,{"$f":"'급여대장(입력)'!C196","v":0},{"$f":"_xlfn.IFNA(VLOOKUP(T215,'급여대장(입력)'!$C$6:$V$22,20,0),0)","v":0},{"$error":"#REF!"},{"$error":"#REF!"},{"$f":"IFERROR(VLOOKUP(T215,표1[[사원명]:[열3]],11,0),0)","v":0},0,{"$error":"#REF!"},{"$error":"#REF!"}]
[null,null,null,null,null,null,null,null,null,null,null,null,null,null,null,null,null,null,210,{"$f":"'급여대장(입력)'!C197","v":0},{"$f":"_xlfn.IFNA(VLOOKUP(T216,'급여대장(입력)'!$C$6:$V$22,20,0),0)","v":0},{"$error":"#REF!"},{"$error":"#REF!"},{"$f":"IFERROR(VLOOKUP(T216,표1[[사원명]:[열3]],11,0),0)","v":0},0,{"$error":"#REF!"},{"$error":"#REF!"}]
[null,null,null,null,null,null,null,null,null,null,null,null,null,null,null,null,null,null,211,{"$f":"'급여대장(입력)'!C198","v":0},{"$f":"_xlfn.IFNA(VLOOKUP(T217,'급여대장(입력)'!$C$6:$V$22,20,0),0)","v":0},{"$error":"#REF!"},{"$error":"#REF!"},{"$f":"IFERROR(VLOOKUP(T217,표1[[사원명]:[열3]],11,0),0)","v":0},0,{"$error":"#REF!"},{"$error":"#REF!"}]
[null,null,null,null,null,null,null,null,null,null,null,null,null,null,null,null,null,null,212,{"$f":"'급여대장(입력)'!C199","v":0},{"$f":"_xlfn.IFNA(VLOOKUP(T218,'급여대장(입력)'!$C$6:$V$22,20,0),0)","v":0},{"$error":"#REF!"},{"$error":"#REF!"},{"$f":"IFERROR(VLOOKUP(T218,표1[[사원명]:[열3]],11,0),0)","v":0},0,{"$error":"#REF!"},{"$error":"#REF!"}]
[null,null,null,null,null,null,null,null,null,null,null,null,null,null,null,null,null,null,213,{"$f":"'급여대장(입력)'!C200","v":0},{"$f":"_xlfn.IFNA(VLOOKUP(T219,'급여대장(입력)'!$C$6:$V$22,20,0),0)","v":0},{"$error":"#REF!"},{"$error":"#REF!"},{"$f":"IFERROR(VLOOKUP(T219,표1[[사원명]:[열3]],11,0),0)","v":0},0,{"$error":"#REF!"},{"$error":"#REF!"}]
[null,null,null,null,null,null,null,null,null,null,null,null,null,null,null,null,null,null,214,{"$f":"'급여대장(입력)'!C201","v":0},{"$f":"_xlfn.IFNA(VLOOKUP(T220,'급여대장(입력)'!$C$6:$V$22,20,0),0)","v":0},{"$error":"#REF!"},{"$error":"#REF!"},{"$f":"IFERROR(VLOOKUP(T220,표1[[사원명]:[열3]],11,0),0)","v":0},0,{"$error":"#REF!"},{"$error":"#REF!"}]
[null,null,null,null,null,null,null,null,null,null,null,null,null,null,null,null,null,null,215,{"$f":"'급여대장(입력)'!C202","v":0},{"$f":"_xlfn.IFNA(VLOOKUP(T221,'급여대장(입력)'!$C$6:$V$22,20,0),0)","v":0},{"$error":"#REF!"},{"$error":"#REF!"},{"$f":"IFERROR(VLOOKUP(T221,표1[[사원명]:[열3]],11,0),0)","v":0},0,{"$error":"#REF!"},{"$error":"#REF!"}]
[null,null,null,null,null,null,null,null,null,null,null,null,null,null,null,null,null,null,216,{"$f":"'급여대장(입력)'!C203","v":0},{"$f":"_xlfn.IFNA(VLOOKUP(T222,'급여대장(입력)'!$C$6:$V$22,20,0),0)","v":0},{"$error":"#REF!"},{"$error":"#REF!"},{"$f":"IFERROR(VLOOKUP(T222,표1[[사원명]:[열3]],11,0),0)","v":0},0,{"$error":"#REF!"},{"$error":"#REF!"}]
[null,null,null,null,null,null,null,null,null,null,null,null,null,null,null,null,null,null,217,{"$f":"'급여대장(입력)'!C204","v":0},{"$f":"_xlfn.IFNA(VLOOKUP(T223,'급여대장(입력)'!$C$6:$V$22,20,0),0)","v":0},{"$error":"#REF!"},{"$error":"#REF!"},{"$f":"IFERROR(VLOOKUP(T223,표1[[사원명]:[열3]],11,0),0)","v":0},0,{"$error":"#REF!"},{"$error":"#REF!"}]
[null,null,null,null,null,null,null,null,null,null,null,null,null,null,null,null,null,null,218,{"$f":"'급여대장(입력)'!C205","v":0},{"$f":"_xlfn.IFNA(VLOOKUP(T224,'급여대장(입력)'!$C$6:$V$22,20,0),0)","v":0},{"$error":"#REF!"},{"$error":"#REF!"},{"$f":"IFERROR(VLOOKUP(T224,표1[[사원명]:[열3]],11,0),0)","v":0},0,{"$error":"#REF!"},{"$error":"#REF!"}]
[null,null,null,null,null,null,null,null,null,null,null,null,null,null,null,null,null,null,219,{"$f":"'급여대장(입력)'!C206","v":0},{"$f":"_xlfn.IFNA(VLOOKUP(T225,'급여대장(입력)'!$C$6:$V$22,20,0),0)","v":0},{"$error":"#REF!"},{"$error":"#REF!"},{"$f":"IFERROR(VLOOKUP(T225,표1[[사원명]:[열3]],11,0),0)","v":0},0,{"$error":"#REF!"},{"$error":"#REF!"}]
[null,null,null,null,null,null,null,null,null,null,null,null,null,null,null,null,null,null,220,{"$f":"'급여대장(입력)'!C207","v":0},{"$f":"_xlfn.IFNA(VLOOKUP(T226,'급여대장(입력)'!$C$6:$V$22,20,0),0)","v":0},{"$error":"#REF!"},{"$error":"#REF!"},{"$f":"IFERROR(VLOOKUP(T226,표1[[사원명]:[열3]],11,0),0)","v":0},0,{"$error":"#REF!"},{"$error":"#REF!"}]
[null,null,null,null,null,null,null,null,null,null,null,null,null,null,null,null,null,null,221,{"$f":"'급여대장(입력)'!C208","v":0},{"$f":"_xlfn.IFNA(VLOOKUP(T227,'급여대장(입력)'!$C$6:$V$22,20,0),0)","v":0},{"$error":"#REF!"},{"$error":"#REF!"},{"$f":"IFERROR(VLOOKUP(T227,표1[[사원명]:[열3]],11,0),0)","v":0},0,{"$error":"#REF!"},{"$error":"#REF!"}]
[null,null,null,null,null,null,null,null,null,null,null,null,null,null,null,null,null,null,222,{"$f":"'급여대장(입력)'!C209","v":0},{"$f":"_xlfn.IFNA(VLOOKUP(T228,'급여대장(입력)'!$C$6:$V$22,20,0),0)","v":0},{"$error":"#REF!"},{"$error":"#REF!"},{"$f":"IFERROR(VLOOKUP(T228,표1[[사원명]:[열3]],11,0),0)","v":0},0,{"$error":"#REF!"},{"$error":"#REF!"}]
[null,null,null,null,null,null,null,null,null,null,null,null,null,null,null,null,null,null,223,{"$f":"'급여대장(입력)'!C210","v":0},{"$f":"_xlfn.IFNA(VLOOKUP(T229,'급여대장(입력)'!$C$6:$V$22,20,0),0)","v":0},{"$error":"#REF!"},{"$error":"#REF!"},{"$f":"IFERROR(VLOOKUP(T229,표1[[사원명]:[열3]],11,0),0)","v":0},0,{"$error":"#REF!"},{"$error":"#REF!"}]
[null,null,null,null,null,null,null,null,null,null,null,null,null,null,null,null,null,null,224,{"$f":"'급여대장(입력)'!C211","v":0},{"$f":"_xlfn.IFNA(VLOOKUP(T230,'급여대장(입력)'!$C$6:$V$22,20,0),0)","v":0},{"$error":"#REF!"},{"$error":"#REF!"},{"$f":"IFERROR(VLOOKUP(T230,표1[[사원명]:[열3]],11,0),0)","v":0},0,{"$error":"#REF!"},{"$error":"#REF!"}]
[null,null,null,null,null,null,null,null,null,null,null,null,null,null,null,null,null,null,225,{"$f":"'급여대장(입력)'!C212","v":0},{"$f":"_xlfn.IFNA(VLOOKUP(T231,'급여대장(입력)'!$C$6:$V$22,20,0),0)","v":0},{"$error":"#REF!"},{"$error":"#REF!"},{"$f":"IFERROR(VLOOKUP(T231,표1[[사원명]:[열3]],11,0),0)","v":0},0,{"$error":"#REF!"},{"$error":"#REF!"}]
[null,null,null,null,null,null,null,null,null,null,null,null,null,null,null,null,null,null,226,{"$f":"'급여대장(입력)'!C213","v":0},{"$f":"_xlfn.IFNA(VLOOKUP(T232,'급여대장(입력)'!$C$6:$V$22,20,0),0)","v":0},{"$error":"#REF!"},{"$error":"#REF!"},{"$f":"IFERROR(VLOOKUP(T232,표1[[사원명]:[열3]],11,0),0)","v":0},0,{"$error":"#REF!"},{"$error":"#REF!"}]
[null,null,null,null,null,null,null,null,null,null,null,null,null,null,null,null,null,null,227,{"$f":"'급여대장(입력)'!C214","v":0},{"$f":"_xlfn.IFNA(VLOOKUP(T233,'급여대장(입력)'!$C$6:$V$22,20,0),0)","v":0},{"$error":"#REF!"},{"$error":"#REF!"},{"$f":"IFERROR(VLOOKUP(T233,표1[[사원명]:[열3]],11,0),0)","v":0},0,{"$error":"#REF!"},{"$error":"#REF!"}]
[null,null,null,null,null,null,null,null,null,null,null,null,null,null,null,null,null,null,228,{"$f":"'급여대장(입력)'!C215","v":0},{"$f":"_xlfn.IFNA(VLOOKUP(T234,'급여대장(입력)'!$C$6:$V$22,20,0),0)","v":0},{"$error":"#REF!"},{"$error":"#REF!"},{"$f":"IFERROR(VLOOKUP(T234,표1[[사원명]:[열3]],11,0),0)","v":0},0,{"$error":"#REF!"},{"$error":"#REF!"}]
[null,null,null,null,null,null,null,null,null,null,null,null,null,null,null,null,null,null,229,{"$f":"'급여대장(입력)'!C216","v":0},{"$f":"_xlfn.IFNA(VLOOKUP(T235,'급여대장(입력)'!$C$6:$V$22,20,0),0)","v":0},{"$error":"#REF!"},{"$error":"#REF!"},{"$f":"IFERROR(VLOOKUP(T235,표1[[사원명]:[열3]],11,0),0)","v":0},0,{"$error":"#REF!"},{"$error":"#REF!"}]
[null,null,null,null,null,null,null,null,null,null,null,null,null,null,null,null,null,null,230,{"$f":"'급여대장(입력)'!C217","v":0},{"$f":"_xlfn.IFNA(VLOOKUP(T236,'급여대장(입력)'!$C$6:$V$22,20,0),0)","v":0},{"$error":"#REF!"},{"$error":"#REF!"},{"$f":"IFERROR(VLOOKUP(T236,표1[[사원명]:[열3]],11,0),0)","v":0},0,{"$error":"#REF!"},{"$error":"#REF!"}]
[null,null,null,null,null,null,null,null,null,null,null,null,null,null,null,null,null,null,231,{"$f":"'급여대장(입력)'!C218","v":0},{"$f":"_xlfn.IFNA(VLOOKUP(T237,'급여대장(입력)'!$C$6:$V$22,20,0),0)","v":0},{"$error":"#REF!"},{"$error":"#REF!"},{"$f":"IFERROR(VLOOKUP(T237,표1[[사원명]:[열3]],11,0),0)","v":0},0,{"$error":"#REF!"},{"$error":"#REF!"}]
[null,null,null,null,null,null,null,null,null,null,null,null,null,null,null,null,null,null,232,{"$f":"'급여대장(입력)'!C219","v":0},{"$f":"_xlfn.IFNA(VLOOKUP(T238,'급여대장(입력)'!$C$6:$V$22,20,0),0)","v":0},{"$error":"#REF!"},{"$error":"#REF!"},{"$f":"IFERROR(VLOOKUP(T238,표1[[사원명]:[열3]],11,0),0)","v":0},0,{"$error":"#REF!"},{"$error":"#REF!"}]
[null,null,null,null,null,null,null,null,null,null,null,null,null,null,null,null,null,null,233,{"$f":"'급여대장(입력)'!C220","v":0},{"$f":"_xlfn.IFNA(VLOOKUP(T239,'급여대장(입력)'!$C$6:$V$22,20,0),0)","v":0},{"$error":"#REF!"},{"$error":"#REF!"},{"$f":"IFERROR(VLOOKUP(T239,표1[[사원명]:[열3]],11,0),0)","v":0},0,{"$error":"#REF!"},{"$error":"#REF!"}]
[null,null,null,null,null,null,null,null,null,null,null,null,null,null,null,null,null,null,234,{"$f":"'급여대장(입력)'!C221","v":0},{"$f":"_xlfn.IFNA(VLOOKUP(T240,'급여대장(입력)'!$C$6:$V$22,20,0),0)","v":0},{"$error":"#REF!"},{"$error":"#REF!"},{"$f":"IFERROR(VLOOKUP(T240,표1[[사원명]:[열3]],11,0),0)","v":0},0,{"$error":"#REF!"},{"$error":"#REF!"}]
[null,null,null,null,null,null,null,null,null,null,null,null,null,null,null,null,null,null,235,{"$f":"'급여대장(입력)'!C222","v":0},{"$f":"_xlfn.IFNA(VLOOKUP(T241,'급여대장(입력)'!$C$6:$V$22,20,0),0)","v":0},{"$error":"#REF!"},{"$error":"#REF!"},{"$f":"IFERROR(VLOOKUP(T241,표1[[사원명]:[열3]],11,0),0)","v":0},0,{"$error":"#REF!"},{"$error":"#REF!"}]
[null,null,null,null,null,null,null,null,null,null,null,null,null,null,null,null,null,null,236,{"$f":"'급여대장(입력)'!C223","v":0},{"$f":"_xlfn.IFNA(VLOOKUP(T242,'급여대장(입력)'!$C$6:$V$22,20,0),0)","v":0},{"$error":"#REF!"},{"$error":"#REF!"},{"$f":"IFERROR(VLOOKUP(T242,표1[[사원명]:[열3]],11,0),0)","v":0},0,{"$error":"#REF!"},{"$error":"#REF!"}]
[null,null,null,null,null,null,null,null,null,null,null,null,null,null,null,null,null,null,237,{"$f":"'급여대장(입력)'!C224","v":0},{"$f":"_xlfn.IFNA(VLOOKUP(T243,'급여대장(입력)'!$C$6:$V$22,20,0),0)","v":0},{"$error":"#REF!"},{"$error":"#REF!"},{"$f":"IFERROR(VLOOKUP(T243,표1[[사원명]:[열3]],11,0),0)","v":0},0,{"$error":"#REF!"},{"$error":"#REF!"}]
[null,null,null,null,null,null,null,null,null,null,null,null,null,null,null,null,null,null,238,{"$f":"'급여대장(입력)'!C225","v":0},{"$f":"_xlfn.IFNA(VLOOKUP(T244,'급여대장(입력)'!$C$6:$V$22,20,0),0)","v":0},{"$error":"#REF!"},{"$error":"#REF!"},{"$f":"IFERROR(VLOOKUP(T244,표1[[사원명]:[열3]],11,0),0)","v":0},0,{"$error":"#REF!"},{"$error":"#REF!"}]
[null,null,null,null,null,null,null,null,null,null,null,null,null,null,null,null,null,null,239,{"$f":"'급여대장(입력)'!C226","v":0},{"$f":"_xlfn.IFNA(VLOOKUP(T245,'급여대장(입력)'!$C$6:$V$22,20,0),0)","v":0},{"$error":"#REF!"},{"$error":"#REF!"},{"$f":"IFERROR(VLOOKUP(T245,표1[[사원명]:[열3]],11,0),0)","v":0},0,{"$error":"#REF!"},{"$error":"#REF!"}]
[null,null,null,null,null,null,null,null,null,null,null,null,null,null,null,null,null,null,240,{"$f":"'급여대장(입력)'!C227","v":0},{"$f":"_xlfn.IFNA(VLOOKUP(T246,'급여대장(입력)'!$C$6:$V$22,20,0),0)","v":0},{"$error":"#REF!"},{"$error":"#REF!"},{"$f":"IFERROR(VLOOKUP(T246,표1[[사원명]:[열3]],11,0),0)","v":0},0,{"$error":"#REF!"},{"$error":"#REF!"}]
[null,null,null,null,null,null,null,null,null,null,null,null,null,null,null,null,null,null,241,{"$f":"'급여대장(입력)'!C228","v":0},{"$f":"_xlfn.IFNA(VLOOKUP(T247,'급여대장(입력)'!$C$6:$V$22,20,0),0)","v":0},{"$error":"#REF!"},{"$error":"#REF!"},{"$f":"IFERROR(VLOOKUP(T247,표1[[사원명]:[열3]],11,0),0)","v":0},0,{"$error":"#REF!"},{"$error":"#REF!"}]
[null,null,null,null,null,null,null,null,null,null,null,null,null,null,null,null,null,null,242,{"$f":"'급여대장(입력)'!C229","v":0},{"$f":"_xlfn.IFNA(VLOOKUP(T248,'급여대장(입력)'!$C$6:$V$22,20,0),0)","v":0},{"$error":"#REF!"},{"$error":"#REF!"},{"$f":"IFERROR(VLOOKUP(T248,표1[[사원명]:[열3]],11,0),0)","v":0},0,{"$error":"#REF!"},{"$error":"#REF!"}]
[null,null,null,null,null,null,null,null,null,null,null,null,null,null,null,null,null,null,243,{"$f":"'급여대장(입력)'!C230","v":0},{"$f":"_xlfn.IFNA(VLOOKUP(T249,'급여대장(입력)'!$C$6:$V$22,20,0),0)","v":0},{"$error":"#REF!"},{"$error":"#REF!"},{"$f":"IFERROR(VLOOKUP(T249,표1[[사원명]:[열3]],11,0),0)","v":0},0,{"$error":"#REF!"},{"$error":"#REF!"}]
[null,null,null,null,null,null,null,null,null,null,null,null,null,null,null,null,null,null,244,{"$f":"'급여대장(입력)'!C231","v":0},{"$f":"_xlfn.IFNA(VLOOKUP(T250,'급여대장(입력)'!$C$6:$V$22,20,0),0)","v":0},{"$error":"#REF!"},{"$error":"#REF!"},{"$f":"IFERROR(VLOOKUP(T250,표1[[사원명]:[열3]],11,0),0)","v":0},0,{"$error":"#REF!"},{"$error":"#REF!"}]
[null,null,null,null,null,null,null,null,null,null,null,null,null,null,null,null,null,null,245,{"$f":"'급여대장(입력)'!C232","v":0},{"$f":"_xlfn.IFNA(VLOOKUP(T251,'급여대장(입력)'!$C$6:$V$22,20,0),0)","v":0},{"$error":"#REF!"},{"$error":"#REF!"},{"$f":"IFERROR(VLOOKUP(T251,표1[[사원명]:[열3]],11,0),0)","v":0},0,{"$error":"#REF!"},{"$error":"#REF!"}]
[null,null,null,null,null,null,null,null,null,null,null,null,null,null,null,null,null,null,246,{"$f":"'급여대장(입력)'!C233","v":0},{"$f":"_xlfn.IFNA(VLOOKUP(T252,'급여대장(입력)'!$C$6:$V$22,20,0),0)","v":0},{"$error":"#REF!"},{"$error":"#REF!"},{"$f":"IFERROR(VLOOKUP(T252,표1[[사원명]:[열3]],11,0),0)","v":0},0,{"$error":"#REF!"},{"$error":"#REF!"}]
[null,null,null,null,null,null,null,null,null,null,null,null,null,null,null,null,null,null,247,{"$f":"'급여대장(입력)'!C234","v":0},{"$f":"_xlfn.IFNA(VLOOKUP(T253,'급여대장(입력)'!$C$6:$V$22,20,0),0)","v":0},{"$error":"#REF!"},{"$error":"#REF!"},{"$f":"IFERROR(VLOOKUP(T253,표1[[사원명]:[열3]],11,0),0)","v":0},0,{"$error":"#REF!"},{"$error":"#REF!"}]
[null,null,null,null,null,null,null,null,null,null,null,null,null,null,null,null,null,null,248,{"$f":"'급여대장(입력)'!C235","v":0},{"$f":"_xlfn.IFNA(VLOOKUP(T254,'급여대장(입력)'!$C$6:$V$22,20,0),0)","v":0},{"$error":"#REF!"},{"$error":"#REF!"},{"$f":"IFERROR(VLOOKUP(T254,표1[[사원명]:[열3]],11,0),0)","v":0},0,{"$error":"#REF!"},{"$error":"#REF!"}]
[null,null,null,null,null,null,null,null,null,null,null,null,null,null,null,null,null,null,249,{"$f":"'급여대장(입력)'!C236","v":0},{"$f":"_xlfn.IFNA(VLOOKUP(T255,'급여대장(입력)'!$C$6:$V$22,20,0),0)","v":0},{"$error":"#REF!"},{"$error":"#REF!"},{"$f":"IFERROR(VLOOKUP(T255,표1[[사원명]:[열3]],11,0),0)","v":0},0,{"$error":"#REF!"},{"$error":"#REF!"}]
[null,null,null,null,null,null,null,null,null,null,null,null,null,null,null,null,null,null,250,{"$f":"'급여대장(입력)'!C237","v":0},{"$f":"_xlfn.IFNA(VLOOKUP(T256,'급여대장(입력)'!$C$6:$V$22,20,0),0)","v":0},{"$error":"#REF!"},{"$error":"#REF!"},{"$f":"IFERROR(VLOOKUP(T256,표1[[사원명]:[열3]],11,0),0)","v":0},0,{"$error":"#REF!"},{"$error":"#REF!"}]
[null,null,null,null,null,null,null,null,null,null,null,null,null,null,null,null,null,null,251,{"$f":"'급여대장(입력)'!C238","v":0},{"$f":"_xlfn.IFNA(VLOOKUP(T257,'급여대장(입력)'!$C$6:$V$22,20,0),0)","v":0},{"$error":"#REF!"},{"$error":"#REF!"},{"$f":"IFERROR(VLOOKUP(T257,표1[[사원명]:[열3]],11,0),0)","v":0},0,{"$error":"#REF!"},{"$error":"#REF!"}]
[null,null,null,null,null,null,null,null,null,null,null,null,null,null,null,null,null,null,252,{"$f":"'급여대장(입력)'!C239","v":0},{"$f":"_xlfn.IFNA(VLOOKUP(T258,'급여대장(입력)'!$C$6:$V$22,20,0),0)","v":0},{"$error":"#REF!"},{"$error":"#REF!"},{"$f":"IFERROR(VLOOKUP(T258,표1[[사원명]:[열3]],11,0),0)","v":0},0,{"$error":"#REF!"},{"$error":"#REF!"}]
[null,null,null,null,null,null,null,null,null,null,null,null,null,null,null,null,null,null,253,{"$f":"'급여대장(입력)'!C240","v":0},{"$f":"_xlfn.IFNA(VLOOKUP(T259,'급여대장(입력)'!$C$6:$V$22,20,0),0)","v":0},{"$error":"#REF!"},{"$error":"#REF!"},{"$f":"IFERROR(VLOOKUP(T259,표1[[사원명]:[열3]],11,0),0)","v":0},0,{"$error":"#REF!"},{"$error":"#REF!"}]
[null,null,null,null,null,null,null,null,null,null,null,null,null,null,null,null,null,null,254,{"$f":"'급여대장(입력)'!C241","v":0},{"$f":"_xlfn.IFNA(VLOOKUP(T260,'급여대장(입력)'!$C$6:$V$22,20,0),0)","v":0},{"$error":"#REF!"},{"$error":"#REF!"},{"$f":"IFERROR(VLOOKUP(T260,표1[[사원명]:[열3]],11,0),0)","v":0},0,{"$error":"#REF!"},{"$error":"#REF!"}]
[null,null,null,null,null,null,null,null,null,null,null,null,null,null,null,null,null,null,255,{"$f":"'급여대장(입력)'!C242","v":0},{"$f":"_xlfn.IFNA(VLOOKUP(T261,'급여대장(입력)'!$C$6:$V$22,20,0),0)","v":0},{"$error":"#REF!"},{"$error":"#REF!"},{"$f":"IFERROR(VLOOKUP(T261,표1[[사원명]:[열3]],11,0),0)","v":0},0,{"$error":"#REF!"},{"$error":"#REF!"}]
[null,null,null,null,null,null,null,null,null,null,null,null,null,null,null,null,null,null,256,{"$f":"'급여대장(입력)'!C243","v":0},{"$f":"_xlfn.IFNA(VLOOKUP(T262,'급여대장(입력)'!$C$6:$V$22,20,0),0)","v":0},{"$error":"#REF!"},{"$error":"#REF!"},{"$f":"IFERROR(VLOOKUP(T262,표1[[사원명]:[열3]],11,0),0)","v":0},0,{"$error":"#REF!"},{"$error":"#REF!"}]
[null,null,null,null,null,null,null,null,null,null,null,null,null,null,null,null,null,null,257,{"$f":"'급여대장(입력)'!C244","v":0},{"$f":"_xlfn.IFNA(VLOOKUP(T263,'급여대장(입력)'!$C$6:$V$22,20,0),0)","v":0},{"$error":"#REF!"},{"$error":"#REF!"},{"$f":"IFERROR(VLOOKUP(T263,표1[[사원명]:[열3]],11,0),0)","v":0},0,{"$error":"#REF!"},{"$error":"#REF!"}]
[null,null,null,null,null,null,null,null,null,null,null,null,null,null,null,null,null,null,258,{"$f":"'급여대장(입력)'!C245","v":0},{"$f":"_xlfn.IFNA(VLOOKUP(T264,'급여대장(입력)'!$C$6:$V$22,20,0),0)","v":0},{"$f":"RANK(U264,$U$7:$U$306)","v":{"$error":"#REF!"}},{"$f":"$V264+COUNTIFS($V$7:$V$306,$V264,$S$7:$S$306,\"<\"&S264)","v":{"$error":"#REF!"}},{"$f":"IFERROR(VLOOKUP(T264,표1[[사원명]:[열3]],11,0),0)","v":0},{"$f":"U264-X264","v":0},{"$f":"RANK(Y264,$Y$7:$Y$306)","v":{"$error":"#REF!"}},{"$f":"$Z264+COUNTIFS($Z$7:$Z$306,$Z264,$S$7:$S$306,\"<\"&S264)","v":{"$error":"#REF!"}}]
[null,null,null,null,null,null,null,null,null,null,null,null,null,null,null,null,null,null,259,{"$f":"'급여대장(입력)'!C246","v":0},{"$f":"_xlfn.IFNA(VLOOKUP(T265,'급여대장(입력)'!$C$6:$V$22,20,0),0)","v":0},{"$error":"#REF!"},{"$error":"#REF!"},{"$f":"IFERROR(VLOOKUP(T265,표1[[사원명]:[열3]],11,0),0)","v":0},0,{"$error":"#REF!"},{"$error":"#REF!"}]
[null,null,null,null,null,null,null,null,null,null,null,null,null,null,null,null,null,null,260,{"$f":"'급여대장(입력)'!C247","v":0},{"$f":"_xlfn.IFNA(VLOOKUP(T266,'급여대장(입력)'!$C$6:$V$22,20,0),0)","v":0},{"$error":"#REF!"},{"$error":"#REF!"},{"$f":"IFERROR(VLOOKUP(T266,표1[[사원명]:[열3]],11,0),0)","v":0},0,{"$error":"#REF!"},{"$error":"#REF!"}]
[null,null,null,null,null,null,null,null,null,null,null,null,null,null,null,null,null,null,261,{"$f":"'급여대장(입력)'!C248","v":0},{"$f":"_xlfn.IFNA(VLOOKUP(T267,'급여대장(입력)'!$C$6:$V$22,20,0),0)","v":0},{"$error":"#REF!"},{"$error":"#REF!"},{"$f":"IFERROR(VLOOKUP(T267,표1[[사원명]:[열3]],11,0),0)","v":0},0,{"$error":"#REF!"},{"$error":"#REF!"}]
[null,null,null,null,null,null,null,null,null,null,null,null,null,null,null,null,null,null,262,{"$f":"'급여대장(입력)'!C249","v":0},{"$f":"_xlfn.IFNA(VLOOKUP(T268,'급여대장(입력)'!$C$6:$V$22,20,0),0)","v":0},{"$error":"#REF!"},{"$error":"#REF!"},{"$f":"IFERROR(VLOOKUP(T268,표1[[사원명]:[열3]],11,0),0)","v":0},0,{"$error":"#REF!"},{"$error":"#REF!"}]
[null,null,null,null,null,null,null,null,null,null,null,null,null,null,null,null,null,null,263,{"$f":"'급여대장(입력)'!C250","v":0},{"$f":"_xlfn.IFNA(VLOOKUP(T269,'급여대장(입력)'!$C$6:$V$22,20,0),0)","v":0},{"$error":"#REF!"},{"$error":"#REF!"},{"$f":"IFERROR(VLOOKUP(T269,표1[[사원명]:[열3]],11,0),0)","v":0},0,{"$error":"#REF!"},{"$error":"#REF!"}]
[null,null,null,null,null,null,null,null,null,null,null,null,null,null,null,null,null,null,264,{"$f":"'급여대장(입력)'!C251","v":0},{"$f":"_xlfn.IFNA(VLOOKUP(T270,'급여대장(입력)'!$C$6:$V$22,20,0),0)","v":0},{"$error":"#REF!"},{"$error":"#REF!"},{"$f":"IFERROR(VLOOKUP(T270,표1[[사원명]:[열3]],11,0),0)","v":0},0,{"$error":"#REF!"},{"$error":"#REF!"}]
[null,null,null,null,null,null,null,null,null,null,null,null,null,null,null,null,null,null,265,{"$f":"'급여대장(입력)'!C252","v":0},{"$f":"_xlfn.IFNA(VLOOKUP(T271,'급여대장(입력)'!$C$6:$V$22,20,0),0)","v":0},{"$error":"#REF!"},{"$error":"#REF!"},{"$f":"IFERROR(VLOOKUP(T271,표1[[사원명]:[열3]],11,0),0)","v":0},0,{"$error":"#REF!"},{"$error":"#REF!"}]
[null,null,null,null,null,null,null,null,null,null,null,null,null,null,null,null,null,null,266,{"$f":"'급여대장(입력)'!C253","v":0},{"$f":"_xlfn.IFNA(VLOOKUP(T272,'급여대장(입력)'!$C$6:$V$22,20,0),0)","v":0},{"$error":"#REF!"},{"$error":"#REF!"},{"$f":"IFERROR(VLOOKUP(T272,표1[[사원명]:[열3]],11,0),0)","v":0},0,{"$error":"#REF!"},{"$error":"#REF!"}]
[null,null,null,null,null,null,null,null,null,null,null,null,null,null,null,null,null,null,267,{"$f":"'급여대장(입력)'!C254","v":0},{"$f":"_xlfn.IFNA(VLOOKUP(T273,'급여대장(입력)'!$C$6:$V$22,20,0),0)","v":0},{"$error":"#REF!"},{"$error":"#REF!"},{"$f":"IFERROR(VLOOKUP(T273,표1[[사원명]:[열3]],11,0),0)","v":0},0,{"$error":"#REF!"},{"$error":"#REF!"}]
[null,null,null,null,null,null,null,null,null,null,null,null,null,null,null,null,null,null,268,{"$f":"'급여대장(입력)'!C255","v":0},{"$f":"_xlfn.IFNA(VLOOKUP(T274,'급여대장(입력)'!$C$6:$V$22,20,0),0)","v":0},{"$error":"#REF!"},{"$error":"#REF!"},{"$f":"IFERROR(VLOOKUP(T274,표1[[사원명]:[열3]],11,0),0)","v":0},0,{"$error":"#REF!"},{"$error":"#REF!"}]
[null,null,null,null,null,null,null,null,null,null,null,null,null,null,null,null,null,null,269,{"$f":"'급여대장(입력)'!C256","v":0},{"$f":"_xlfn.IFNA(VLOOKUP(T275,'급여대장(입력)'!$C$6:$V$22,20,0),0)","v":0},{"$error":"#REF!"},{"$error":"#REF!"},{"$f":"IFERROR(VLOOKUP(T275,표1[[사원명]:[열3]],11,0),0)","v":0},0,{"$error":"#REF!"},{"$error":"#REF!"}]
[null,null,null,null,null,null,null,null,null,null,null,null,null,null,null,null,null,null,270,{"$f":"'급여대장(입력)'!C257","v":0},{"$f":"_xlfn.IFNA(VLOOKUP(T276,'급여대장(입력)'!$C$6:$V$22,20,0),0)","v":0},{"$error":"#REF!"},{"$error":"#REF!"},{"$f":"IFERROR(VLOOKUP(T276,표1[[사원명]:[열3]],11,0),0)","v":0},0,{"$error":"#REF!"},{"$error":"#REF!"}]
[null,null,null,null,null,null,null,null,null,null,null,null,null,null,null,null,null,null,271,{"$f":"'급여대장(입력)'!C258","v":0},{"$f":"_xlfn.IFNA(VLOOKUP(T277,'급여대장(입력)'!$C$6:$V$22,20,0),0)","v":0},{"$error":"#REF!"},{"$error":"#REF!"},{"$f":"IFERROR(VLOOKUP(T277,표1[[사원명]:[열3]],11,0),0)","v":0},0,{"$error":"#REF!"},{"$error":"#REF!"}]
[null,null,null,null,null,null,null,null,null,null,null,null,null,null,null,null,null,null,272,{"$f":"'급여대장(입력)'!C259","v":0},{"$f":"_xlfn.IFNA(VLOOKUP(T278,'급여대장(입력)'!$C$6:$V$22,20,0),0)","v":0},{"$error":"#REF!"},{"$error":"#REF!"},{"$f":"IFERROR(VLOOKUP(T278,표1[[사원명]:[열3]],11,0),0)","v":0},0,{"$error":"#REF!"},{"$error":"#REF!"}]
[null,null,null,null,null,null,null,null,null,null,null,null,null,null,null,null,null,null,273,{"$f":"'급여대장(입력)'!C260","v":0},{"$f":"_xlfn.IFNA(VLOOKUP(T279,'급여대장(입력)'!$C$6:$V$22,20,0),0)","v":0},{"$error":"#REF!"},{"$error":"#REF!"},{"$f":"IFERROR(VLOOKUP(T279,표1[[사원명]:[열3]],11,0),0)","v":0},0,{"$error":"#REF!"},{"$error":"#REF!"}]
[null,null,null,null,null,null,null,null,null,null,null,null,null,null,null,null,null,null,274,{"$f":"'급여대장(입력)'!C261","v":0},{"$f":"_xlfn.IFNA(VLOOKUP(T280,'급여대장(입력)'!$C$6:$V$22,20,0),0)","v":0},{"$error":"#REF!"},{"$error":"#REF!"},{"$f":"IFERROR(VLOOKUP(T280,표1[[사원명]:[열3]],11,0),0)","v":0},0,{"$error":"#REF!"},{"$error":"#REF!"}]
[null,null,null,null,null,null,null,null,null,null,null,null,null,null,null,null,null,null,275,{"$f":"'급여대장(입력)'!C262","v":0},{"$f":"_xlfn.IFNA(VLOOKUP(T281,'급여대장(입력)'!$C$6:$V$22,20,0),0)","v":0},{"$error":"#REF!"},{"$error":"#REF!"},{"$f":"IFERROR(VLOOKUP(T281,표1[[사원명]:[열3]],11,0),0)","v":0},0,{"$error":"#REF!"},{"$error":"#REF!"}]
[null,null,null,null,null,null,null,null,null,null,null,null,null,null,null,null,null,null,276,{"$f":"'급여대장(입력)'!C263","v":0},{"$f":"_xlfn.IFNA(VLOOKUP(T282,'급여대장(입력)'!$C$6:$V$22,20,0),0)","v":0},{"$error":"#REF!"},{"$error":"#REF!"},{"$f":"IFERROR(VLOOKUP(T282,표1[[사원명]:[열3]],11,0),0)","v":0},0,{"$error":"#REF!"},{"$error":"#REF!"}]
[null,null,null,null,null,null,null,null,null,null,null,null,null,null,null,null,null,null,277,{"$f":"'급여대장(입력)'!C264","v":0},{"$f":"_xlfn.IFNA(VLOOKUP(T283,'급여대장(입력)'!$C$6:$V$22,20,0),0)","v":0},{"$error":"#REF!"},{"$error":"#REF!"},{"$f":"IFERROR(VLOOKUP(T283,표1[[사원명]:[열3]],11,0),0)","v":0},0,{"$error":"#REF!"},{"$error":"#REF!"}]
[null,null,null,null,null,null,null,null,null,null,null,null,null,null,null,null,null,null,278,{"$f":"'급여대장(입력)'!C265","v":0},{"$f":"_xlfn.IFNA(VLOOKUP(T284,'급여대장(입력)'!$C$6:$V$22,20,0),0)","v":0},{"$error":"#REF!"},{"$error":"#REF!"},{"$f":"IFERROR(VLOOKUP(T284,표1[[사원명]:[열3]],11,0),0)","v":0},0,{"$error":"#REF!"},{"$error":"#REF!"}]
[null,null,null,null,null,null,null,null,null,null,null,null,null,null,null,null,null,null,279,{"$f":"'급여대장(입력)'!C266","v":0},{"$f":"_xlfn.IFNA(VLOOKUP(T285,'급여대장(입력)'!$C$6:$V$22,20,0),0)","v":0},{"$error":"#REF!"},{"$error":"#REF!"},{"$f":"IFERROR(VLOOKUP(T285,표1[[사원명]:[열3]],11,0),0)","v":0},0,{"$error":"#REF!"},{"$error":"#REF!"}]
[null,null,null,null,null,null,null,null,null,null,null,null,null,null,null,null,null,null,280,{"$f":"'급여대장(입력)'!C267","v":0},{"$f":"_xlfn.IFNA(VLOOKUP(T286,'급여대장(입력)'!$C$6:$V$22,20,0),0)","v":0},{"$error":"#REF!"},{"$error":"#REF!"},{"$f":"IFERROR(VLOOKUP(T286,표1[[사원명]:[열3]],11,0),0)","v":0},0,{"$error":"#REF!"},{"$error":"#REF!"}]
[null,null,null,null,null,null,null,null,null,null,null,null,null,null,null,null,null,null,281,{"$f":"'급여대장(입력)'!C268","v":0},{"$f":"_xlfn.IFNA(VLOOKUP(T287,'급여대장(입력)'!$C$6:$V$22,20,0),0)","v":0},{"$error":"#REF!"},{"$error":"#REF!"},{"$f":"IFERROR(VLOOKUP(T287,표1[[사원명]:[열3]],11,0),0)","v":0},0,{"$error":"#REF!"},{"$error":"#REF!"}]
[null,null,null,null,null,null,null,null,null,null,null,null,null,null,null,null,null,null,282,{"$f":"'급여대장(입력)'!C269","v":0},{"$f":"_xlfn.IFNA(VLOOKUP(T288,'급여대장(입력)'!$C$6:$V$22,20,0),0)","v":0},{"$error":"#REF!"},{"$error":"#REF!"},{"$f":"IFERROR(VLOOKUP(T288,표1[[사원명]:[열3]],11,0),0)","v":0},0,{"$error":"#REF!"},{"$error":"#REF!"}]
[null,null,null,null,null,null,null,null,null,null,null,null,null,null,null,null,null,null,283,{"$f":"'급여대장(입력)'!C270","v":0},{"$f":"_xlfn.IFNA(VLOOKUP(T289,'급여대장(입력)'!$C$6:$V$22,20,0),0)","v":0},{"$error":"#REF!"},{"$error":"#REF!"},{"$f":"IFERROR(VLOOKUP(T289,표1[[사원명]:[열3]],11,0),0)","v":0},0,{"$error":"#REF!"},{"$error":"#REF!"}]
[null,null,null,null,null,null,null,null,null,null,null,null,null,null,null,null,null,null,284,{"$f":"'급여대장(입력)'!C271","v":0},{"$f":"_xlfn.IFNA(VLOOKUP(T290,'급여대장(입력)'!$C$6:$V$22,20,0),0)","v":0},{"$error":"#REF!"},{"$error":"#REF!"},{"$f":"IFERROR(VLOOKUP(T290,표1[[사원명]:[열3]],11,0),0)","v":0},0,{"$error":"#REF!"},{"$error":"#REF!"}]
[null,null,null,null,null,null,null,null,null,null,null,null,null,null,null,null,null,null,285,{"$f":"'급여대장(입력)'!C272","v":0},{"$f":"_xlfn.IFNA(VLOOKUP(T291,'급여대장(입력)'!$C$6:$V$22,20,0),0)","v":0},{"$error":"#REF!"},{"$error":"#REF!"},{"$f":"IFERROR(VLOOKUP(T291,표1[[사원명]:[열3]],11,0),0)","v":0},0,{"$error":"#REF!"},{"$error":"#REF!"}]
[null,null,null,null,null,null,null,null,null,null,null,null,null,null,null,null,null,null,286,{"$f":"'급여대장(입력)'!C273","v":0},{"$f":"_xlfn.IFNA(VLOOKUP(T292,'급여대장(입력)'!$C$6:$V$22,20,0),0)","v":0},{"$error":"#REF!"},{"$error":"#REF!"},{"$f":"IFERROR(VLOOKUP(T292,표1[[사원명]:[열3]],11,0),0)","v":0},0,{"$error":"#REF!"},{"$error":"#REF!"}]
[null,null,null,null,null,null,null,null,null,null,null,null,null,null,null,null,null,null,287,{"$f":"'급여대장(입력)'!C274","v":0},{"$f":"_xlfn.IFNA(VLOOKUP(T293,'급여대장(입력)'!$C$6:$V$22,20,0),0)","v":0},{"$error":"#REF!"},{"$error":"#REF!"},{"$f":"IFERROR(VLOOKUP(T293,표1[[사원명]:[열3]],11,0),0)","v":0},0,{"$error":"#REF!"},{"$error":"#REF!"}]
[null,null,null,null,null,null,null,null,null,null,null,null,null,null,null,null,null,null,288,{"$f":"'급여대장(입력)'!C275","v":0},{"$f":"_xlfn.IFNA(VLOOKUP(T294,'급여대장(입력)'!$C$6:$V$22,20,0),0)","v":0},{"$error":"#REF!"},{"$error":"#REF!"},{"$f":"IFERROR(VLOOKUP(T294,표1[[사원명]:[열3]],11,0),0)","v":0},0,{"$error":"#REF!"},{"$error":"#REF!"}]
[null,null,null,null,null,null,null,null,null,null,null,null,null,null,null,null,null,null,289,{"$f":"'급여대장(입력)'!C276","v":0},{"$f":"_xlfn.IFNA(VLOOKUP(T295,'급여대장(입력)'!$C$6:$V$22,20,0),0)","v":0},{"$error":"#REF!"},{"$error":"#REF!"},{"$f":"IFERROR(VLOOKUP(T295,표1[[사원명]:[열3]],11,0),0)","v":0},0,{"$error":"#REF!"},{"$error":"#REF!"}]
[null,null,null,null,null,null,null,null,null,null,null,null,null,null,null,null,null,null,290,{"$f":"'급여대장(입력)'!C277","v":0},{"$f":"_xlfn.IFNA(VLOOKUP(T296,'급여대장(입력)'!$C$6:$V$22,20,0),0)","v":0},{"$error":"#REF!"},{"$error":"#REF!"},{"$f":"IFERROR(VLOOKUP(T296,표1[[사원명]:[열3]],11,0),0)","v":0},0,{"$error":"#REF!"},{"$error":"#REF!"}]
[null,null,null,null,null,null,null,null,null,null,null,null,null,null,null,null,null,null,291,{"$f":"'급여대장(입력)'!C278","v":0},{"$f":"_xlfn.IFNA(VLOOKUP(T297,'급여대장(입력)'!$C$6:$V$22,20,0),0)","v":0},{"$error":"#REF!"},{"$error":"#REF!"},{"$f":"IFERROR(VLOOKUP(T297,표1[[사원명]:[열3]],11,0),0)","v":0},0,{"$error":"#REF!"},{"$error":"#REF!"}]
[null,null,null,null,null,null,null,null,null,null,null,null,null,null,null,null,null,null,292,{"$f":"'급여대장(입력)'!C279","v":0},{"$f":"_xlfn.IFNA(VLOOKUP(T298,'급여대장(입력)'!$C$6:$V$22,20,0),0)","v":0},{"$error":"#REF!"},{"$error":"#REF!"},{"$f":"IFERROR(VLOOKUP(T298,표1[[사원명]:[열3]],11,0),0)","v":0},0,{"$error":"#REF!"},{"$error":"#REF!"}]
[null,null,null,null,null,null,null,null,null,null,null,null,null,null,null,null,null,null,293,{"$f":"'급여대장(입력)'!C280","v":0},{"$f":"_xlfn.IFNA(VLOOKUP(T299,'급여대장(입력)'!$C$6:$V$22,20,0),0)","v":0},{"$error":"#REF!"},{"$error":"#REF!"},{"$f":"IFERROR(VLOOKUP(T299,표1[[사원명]:[열3]],11,0),0)","v":0},0,{"$error":"#REF!"},{"$error":"#REF!"}]
[null,null,null,null,null,null,null,null,null,null,null,null,null,null,null,null,null,null,294,{"$f":"'급여대장(입력)'!C281","v":0},{"$f":"_xlfn.IFNA(VLOOKUP(T300,'급여대장(입력)'!$C$6:$V$22,20,0),0)","v":0},{"$error":"#REF!"},{"$error":"#REF!"},{"$f":"IFERROR(VLOOKUP(T300,표1[[사원명]:[열3]],11,0),0)","v":0},0,{"$error":"#REF!"},{"$error":"#REF!"}]
[null,null,null,null,null,null,null,null,null,null,null,null,null,null,null,null,null,null,295,{"$f":"'급여대장(입력)'!C282","v":0},{"$f":"_xlfn.IFNA(VLOOKUP(T301,'급여대장(입력)'!$C$6:$V$22,20,0),0)","v":0},{"$error":"#REF!"},{"$error":"#REF!"},{"$f":"IFERROR(VLOOKUP(T301,표1[[사원명]:[열3]],11,0),0)","v":0},0,{"$error":"#REF!"},{"$error":"#REF!"}]
[null,null,null,null,null,null,null,null,null,null,null,null,null,null,null,null,null,null,296,{"$f":"'급여대장(입력)'!C283","v":0},{"$f":"_xlfn.IFNA(VLOOKUP(T302,'급여대장(입력)'!$C$6:$V$22,20,0),0)","v":0},{"$error":"#REF!"},{"$error":"#REF!"},{"$f":"IFERROR(VLOOKUP(T302,표1[[사원명]:[열3]],11,0),0)","v":0},0,{"$error":"#REF!"},{"$error":"#REF!"}]
[null,null,null,null,null,null,null,null,null,null,null,null,null,null,null,null,null,null,297,{"$f":"'급여대장(입력)'!C284","v":0},{"$f":"_xlfn.IFNA(VLOOKUP(T303,'급여대장(입력)'!$C$6:$V$22,20,0),0)","v":0},{"$error":"#REF!"},{"$error":"#REF!"},{"$f":"IFERROR(VLOOKUP(T303,표1[[사원명]:[열3]],11,0),0)","v":0},0,{"$error":"#REF!"},{"$error":"#REF!"}]
[null,null,null,null,null,null,null,null,null,null,null,null,null,null,null,null,null,null,298,{"$f":"'급여대장(입력)'!C285","v":0},{"$f":"_xlfn.IFNA(VLOOKUP(T304,'급여대장(입력)'!$C$6:$V$22,20,0),0)","v":0},{"$error":"#REF!"},{"$error":"#REF!"},{"$f":"IFERROR(VLOOKUP(T304,표1[[사원명]:[열3]],11,0),0)","v":0},0,{"$error":"#REF!"},{"$error":"#REF!"}]
[null,null,null,null,null,null,null,null,null,null,null,null,null,null,null,null,null,null,299,{"$f":"'급여대장(입력)'!C286","v":0},{"$f":"_xlfn.IFNA(VLOOKUP(T305,'급여대장(입력)'!$C$6:$V$22,20,0),0)","v":0},{"$error":"#REF!"},{"$error":"#REF!"},{"$f":"IFERROR(VLOOKUP(T305,표1[[사원명]:[열3]],11,0),0)","v":0},0,{"$error":"#REF!"},{"$error":"#REF!"}]
[null,null,null,null,null,null,null,null,null,null,null,null,null,null,null,null,null,null,300,{"$f":"'급여대장(입력)'!C287","v":0},{"$f":"_xlfn.IFNA(VLOOKUP(T306,'급여대장(입력)'!$C$6:$V$22,20,0),0)","v":0},{"$error":"#REF!"},{"$error":"#REF!"},{"$f":"IFERROR(VLOOKUP(T306,표1[[사원명]:[열3]],11,0),0)","v":0},0,{"$error":"#REF!"},{"$error":"#REF!"}]